{"text_format":"1","workbook":"xlsx","n_sheets":5,"sheets":["Sex list","Random Punishment","Dice Games","BDSM list","Dice Game"],"not_rendered":{"charts":0,"images":0,"macros":1,"external_links":0,"defined_names":1,"comments":0,"pivot_tables":0},"unopened":[],"bounds":{"document_bytes":16777216,"sheet_cells":100000,"rows_first":2000,"rows_last":500,"rows_between":2000,"halvings":0,"cell_chars":16384,"cell_head_chars":4096},"cells_cut":0,"cells_raw":0,"read":"whole","date_system":"1900"}

{"sheet":"Sex list","index":0,"n_rows":879,"n_cols":14,"rows_kept":879,"cut":false,"hidden":true,"merged":[[2,1,2,5]]}
[]
[null,"v005","870 entries",null,null,"     The SEX List"]
[null,"    It is possible that ideas on this list are never tried out before, so think twice before doing anything from this list.\n      This list is just to give you some inspiration, but you have the responsibility of yourself and/or others. Read this: http://bestslavetraining.com/bondagesafe.htm"]
[]
[null,"Category","Content","Online","Level","Idea","Rating",null,null,"Category","Content","Online","Level","Rating"]
[null,"BDSM","Humiliation","No","Medium","Act as objects (furniture, ashtray, footstool, art, etc.) ","****",null,null,"Couple","Idea","Yes","Soft","*"]
[null,"BDSM","Humiliation","No","Medium","After sex, making sub lick off your cum and her juices from your penis ","****",null,null,"Toys","Punishment","No","Medium","**"]
[null,"BDSM","Humiliation","Yes","Medium","Age play","****",null,null,"Domination","Tease",null,"Kinky","***"]
[null,"BDSM","Humiliation","Yes","Medium","Anal plugs under clothing ","****",null,null,"Dare","Worship",null,"Hard","****"]
[null,"BDSM","Humiliation","No","Medium","Ask for drink, food, cigarettes, etc.","**",null,null,"BDSM","Rule",null,"Painful","*****"]
[null,"BDSM","Humiliation","No","Medium","Bathroom use control","***",null,null,"Dice","Spanking"]
[null,"BDSM","Humiliation","Yes","Medium","Blindfolds ","*****",null,null,"Website","Gallery"]
[null,"BDSM","Humiliation","No","Medium","Bondage that exposes body and/or places in odd positions","****",null,null,"Truth","Forum"]
[null,"BDSM","Humiliation","Yes","Medium","Boot worship at odd moments ","***",null,null,null,"Outdoor"]
[null,"BDSM","Humiliation","No","Medium","Caged in private and alone ","****",null,null,null,"Striptease"]
[null,"BDSM","Humiliation","Yes","Medium","Carrying a doll or toy around","**",null,null,null,"Anal"]
[null,"BDSM","Humiliation","No","Medium","Crawl on all 4s","**",null,null,null,"Ass"]
[null,"BDSM","Humiliation","Yes","Medium","Cum or urinate into their food","*",null,null,null,"Oral"]
[null,"BDSM","Humiliation","Yes","Medium","Curse words (Whore, Slut, Worthless, etc.)","***",null,null,null,"Sex"]
[null,"BDSM","Humiliation","Yes","Medium","Dancing/stripped tease","***",null,null,null,"Masturbation"]
[null,"BDSM","Humiliation","No","Medium","Displayed in cage","***",null,null,null,"Denial"]
[null,"BDSM","Humiliation","Yes","Medium","Earrings that don't match","**",null,null,null,"Clothes"]
[null,"BDSM","Humiliation","Yes","Medium","Eat from a pet dish","***",null,null,null,"Roleplaying"]
[null,"BDSM","Humiliation","Yes","Medium","Eat from floor","***",null,null,null,"Piss"]
[null,"BDSM","Humiliation","No","Medium","Eat without utensils","**",null,null,null,"Humiliation"]
[null,"BDSM","Punishment","Yes","Painful","Empty your bladder, then cut a sliver of soap off and insert it into your dick. Now masturbate. You'll have a very painful orgasm ans soapy cum, the pain will last for hours","***",null,null,null,"Same sex"]
[null,"BDSM","Humiliation","Yes","Kinky","Enema","***",null,null,null,"Groupsex"]
[null,"BDSM","Punishment","Yes","Kinky","Enema.","***"]
[null,"BDSM","Humiliation","Yes","Medium","Eye contact restrictions","****"]
[null,"BDSM","Humiliation","No","Medium","Feed submissive from hand","***"]
[null,"BDSM","Humiliation","Yes","Medium","Foot worship","****"]
[null,"BDSM","Humiliation","No","Medium","Forced masturbation where Master chooses in public places","****"]
[null,"BDSM","Humiliation","Yes","Medium","Forced nudity","***"]
[null,"BDSM","Humiliation","Yes","Medium","Forced shopping for BDSM toys","***"]
[null,"BDSM","Humiliation","No","Medium","Forced slave auction","**"]
[null,"BDSM","Humiliation","No","Medium","Forced to go to bathroom in front of others","**"]
[null,"BDSM","Punishment","No","Kinky","get a robe. search the mid to get a \"2 strings robe\" (hope you understand what i want to say) Put it around the stomach over the hip. Put the lose ends trough the \"mid loop\". Go downwards through the pussy and up the ass again. Now take the rope ends up to the ceiling through a tang, hoe or around a balk (for example). Now tie the hands together and tie them to the robe coming from the ceiling. Try to adjust the length that the bound one has to stand on her toes and with the arms high in the air. Now wait...","***"]
[null,"BDSM","Punishment","No","Kinky","Get your slave to kneel on all four. Put an hook their ass and connect it with a rope to the head bending backwards. The more they want to lower their head, the more it'll hurt.","****"]
[null,"BDSM","Humiliation","Yes","Medium","Golden shower","****"]
[null,"BDSM","Humiliation","No","Medium","Handcuffed to a shopping cart while shopping","**"]
[null,"BDSM","Humiliation","No","Medium","Handcuffs in public","**"]
[null,"BDSM","Punishment","No","Kinky","Hanging from the ceiling by his wrists.","***"]
[null,"BDSM","Humiliation","No","Medium","Harem--serving with others","**"]
[null,"BDSM","Humiliation","Yes","Medium","Having clothing chosen for her","***"]
[null,"BDSM","Humiliation","Yes","Medium","Having food chosen for her","***"]
[null,"BDSM","Punishment","No","Kinky","Hog tied. (wrists and ankles tied together)","****"]
[null,"BDSM","Humiliation","Yes","Medium","Hold ping pong ball or coin against wall with nose","***"]
[null,"BDSM","Humiliation","No","Medium","Hood","**"]
[null,"BDSM","Humiliation","No","Medium","Human Garbage Can","**"]
[null,"BDSM","Punishment","No","Kinky","If you pee your self you cant change what your wearing"]
[null,"BDSM","Humiliation","No","Medium","Ignoring slave"]
[null,"BDSM","Humiliation","No","Medium","Immobilization"]
[null,"BDSM","Humiliation","Yes","Medium","Inspection of body cavities in private"]
[null,"BDSM","Humiliation","No","Medium","Inspection of body cavities in public"]
[null,"BDSM","Humiliation","No","Medium","Lead on leash"]
[null,"BDSM","Punishment","Yes","Kinky","leave an object of choice up your ass or vagina for X number of hours or days"]
[null,"BDSM","Humiliation","No","Medium","Leave bathroom door opened"]
[null,"BDSM","Humiliation","No","Medium","Leave note with embarrassing instructions"]
[null,"BDSM","Humiliation","No","Medium","Made to urinate in front of others"]
[null,"BDSM","Humiliation","No","Medium","Maid services"]
[null,"BDSM","Idea","Yes","Medium","Make a bag with punishments and let him/her take one"]
[null,"BDSM","Humiliation","No","Medium","Make sub wear underwear that you've urinated on"]
[null,"BDSM","Humiliation","No","Medium","Mask"]
[null,"BDSM","Humiliation","No","Medium","Nipple clamps under see thru top"]
[null,"BDSM","Humiliation","Yes","Medium","Orgasm control and/or denial"]
[null,"BDSM","Humiliation","No","Medium","Pet roles (act like a dog, cat, etc.)"]
[null,"BDSM","Humiliation","No","Medium","Presenting in private and public"]
[null,"BDSM","Punishment","Yes","Kinky","Put on a belt, tie a rope with knots on the belt at your back and let the rope go through your ass and pussy. Then put the rope trhough the front belt and tie the end to something heavy. When the rope is pulled the knots will hurt."]
[null,"BDSM","Humiliation","No","Medium","Scat play"]
[null,"BDSM","Humiliation","Yes","Medium","Send shopping with note and hand it to clerk"]
[null,"BDSM","Humiliation","No","Medium","Serve others (supervised or unsupervised)"]
[null,"BDSM","Humiliation","Yes","Medium","Shave head"]
[null,"BDSM","Humiliation","Yes","Medium","Shave pubic hair"]
[null,"BDSM","Humiliation","No","Medium","Slap face"]
[null,"BDSM","Humiliation","Yes","Medium","slave positions (kneel, stand, etc.)"]
[null,"BDSM","Punishment","No","Kinky","Spank him/her"]
[null,"BDSM","Humiliation","No","Medium","Spanking (public)"]
[null,"BDSM","Humiliation","Yes","Medium","Speech restriction"]
[null,"BDSM","Humiliation","No","Medium","Stand in corner"]
[null,"BDSM","Humiliation","No","Medium","Suck dildo in car, so others can see"]
[null,"BDSM","Humiliation","Yes","Medium","Swallow urine"]
[null,"BDSM","Humiliation","Yes","Medium","Take pictures or videos"]
[null,"BDSM","Humiliation","Yes","Medium","Tattoos (temporary)"]
[null,"BDSM","Humiliation","No","Medium","Undress in front of others"]
[null,"BDSM","Humiliation","Yes","Medium","Verbal abuse"]
[null,"BDSM","Humiliation","Yes","Medium","Wear a sign around neck or write on body (slut, slave, etc.)"]
[null,"BDSM","Humiliation","No","Medium","Wear cat collar with bell on ankle in public"]
[null,"BDSM","Humiliation","Yes","Medium","Wear clothes that are ripped or mismatched."]
[null,"BDSM","Humiliation","No","Medium","Wear collar everywhere"]
[null,"BDSM","Humiliation","Yes","Medium","Wear diapers"]
[null,"BDSM","Humiliation","No","Medium","Wear Masters cum on your face without wiping"]
[null,"BDSM","Humiliation","Yes","Medium","Wear no bra under see thru top"]
[null,"BDSM","Humiliation","Yes","Medium","Wear no panties under see thru clothes"]
[null,"BDSM","Punishment","No","Medium","Write something emberassing on his/her forehead"]
[null,"Couple","Idea","No","Medium","A blindfold is one thing, but a blindfold while listening to music with a headphone is something else","***"]
[null,"Couple","Outdoor","No","Medium","Blindfold your partner in the car, drive to a good place where noone is around let him/her step out of the car and start doing him/her ","**"]
[null,"Couple","Idea","No","Soft","Buy a clone boy in the sexshop and make a second mr happy","***"]
[null,"Couple","Idea","No","Medium","Buy sextoys for eachother","****"]
[null,"Couple","Idea","No","Soft","for the women: cum before having sex, your pussy will be tighter","****"]
[null,"Couple","Outdoor","No","Kinky","Have a blowjob while driving","*****"]
[null,"Couple","Roleplaying","No","Medium","Have dress up sex, you can be dressed as a bunny, a whore, a gigolo, a bride, ,,,,","***"]
[null,"Couple","Outdoor","No","Kinky","Have sex in a public toilet","****"]
[null,"Couple","Outdoor","No","Medium","Have sex In the center of a wide open field","*****"]
[null,"Couple","Outdoor","No","Kinky","Have sex in the office","***"]
[null,"Couple","Outdoor","No","Medium","Have sex in the woods","****"]
[null,"Couple","Outdoor","No","Medium","Have sex in your car","***"]
[null,"Couple","Outdoor","No","Medium","Have sex on the beach","****"]
[null,"Couple","Outdoor","No","Medium","have sex on the top of a mountain","****"]
[null,"Couple","Idea","No","Medium","Let this site decide for you which position to do: http://www.menshealth.com/sexpositionmaster/getlucky.html "]
[null,"Couple","Idea","No","Soft","Make 10 yes or no questions (like: blindfold? Handcuffs? In kitchen? On the floor? ,,,) and let your partner answer 10 times yes or no without knowing what the questions are,,,"]
[null,"Couple","Idea","Yes","Medium","Make a list with things to do from 2 to 12 and throw a dice to decide which thing you'll do"]
[null,"Couple","Roleplaying","No","Medium","Make a script and play a roleplaying game or do one of these: http://www.xeromag.com/fvbdsm_scenarios.html#rpanchor "]
[null,"Couple","Idea","No","Medium","Make a script for a porn movie in which you'll play with your partner"]
[null,"Couple","Idea","Yes","Soft","Organize your own photoshoot"]
[null,"Couple","Outdoor","No","Kinky","Park your car somewhere and tie your partner on the backseat"]
[null,"Couple","Masturbation","Yes","Soft","Search a 25 hot pictures for your partner on the internet and do her/him while you show them"]
[null,"Couple","Idea","Yes","Medium","Shave eachother"]
[null,"Couple","Idea","No","Soft","Tape your own sex video like Paris Hilton"]
[null,"Couple","Tease","No","Soft","Tie him down and seduce him for an hour, let him almost cum. Untie him and set the beast free...."]
[null,"Couple","Outdoor","No","Medium","Tie your partner on a tree while doing it"]
[null,"Couple","Idea","No","Kinky","Try anal sex, but start carefull, don't go all the way the first time"]
[null,"Couple","Idea","No","Kinky","Watch a porn movie and imitate it"]
[null,"Couple","Idea","No","Medium","Watch a porn movie together and do eachother"]
[null,"Couple","Idea","No","Medium","Watch a porn movie together and you and your partner do theirselfs"]
[null,"Dare","Humiliation","Yes","Soft","Act like a baby for a FULL turn.","**"]
[null,"Dare","Roleplaying","Yes","Soft","Act like an animal (horse, chicken, pig, rabbit, bird, cat, dog)","****"]
[null,"Dare","Idea","No","Medium","Allow TARGET player to caress your back.","**"]
[null,"Dare","Idea","No","Medium","Allow TARGET player to caress your bottom.","**"]
[null,"Dare","Idea","No","Medium","Allow TARGET player to caress your breasts/chest.","**"]
[null,"Dare","Idea","No","Medium","Allow TARGET player to caress your feet.","**"]
[null,"Dare","Idea","No","Medium","Allow TARGET player to caress your hair.","**"]
[null,"Dare","Idea","No","Medium","Allow TARGET player to caress your hands.","**"]
[null,"Dare","Idea","No","Medium","Allow TARGET player to caress your shoulders.","**"]
[null,"Dare","Idea","No","Medium","Allow TARGET player to caress your stomach.","**"]
[null,"Dare","Idea","No","Medium","Allow TARGET player to caress your thighs.","**"]
[null,"Dare","Idea","No","Medium","Allow TARGET player to kiss you anywhere on your body that they choose.","***"]
[null,"Dare","Idea","No","Medium","Allow TARGET player to kiss you on the back of your knees.","***"]
[null,"Dare","Idea","No","Medium","Allow TARGET player to kiss you on the back of your neck.","***"]
[null,"Dare","Idea","No","Medium","Allow TARGET player to kiss you on your bottom.","***"]
[null,"Dare","Idea","No","Medium","Allow TARGET player to kiss you on your breasts/chest.","***"]
[null,"Dare","Idea","No","Medium","Allow TARGET player to kiss you on your calves.","***"]
[null,"Dare","Idea","No","Medium","Allow TARGET player to kiss you on your feet.","***"]
[null,"Dare","Idea","No","Medium","Allow TARGET player to kiss you on your nipples.","***"]
[null,"Dare","Idea","No","Medium","Allow TARGET player to kiss you on your stomach.","***"]
[null,"Dare","Idea","No","Medium","Allow TARGET player to kiss you up and down your backside.","***"]
[null,"Dare","Idea","No","Medium","Allow TARGET player to masturbate you under your clothes, while you watch everyone watching you.","****"]
[null,"Dare","Idea","No","Medium","Allow TARGET player to rub your crotch with their feet.","****"]
[null,"Dare","Idea","No","Medium","Allow TARGET player to sensuously undress you to your underwear.","*****"]
[null,"Dare","Idea","No","Medium","Allow TARGET player to sensuously undress you until naked.","*****"]
[null,"Dare","Idea","No","Medium","Alternate with warm and cold water in your mouth, performing oral sex on TARGET player.","**"]
[null,"Dare","Idea","No","Soft","Blow a raspberry on someone's stomach.","**"]
[null,"Dare","Idea","No","Soft","Blow in somebody's ear.","***"]
[null,"Dare","Idea","Yes","Kinky","Blow up as many water balloons that you've decided with a dice and stuff\nthem in your underwear. Now hump the balloons until you pop them all.","****"]
[null,"Dare","Masturbation","Yes","Soft","Can you cum all over the picture that i sent you of me, and take a photo of it and send it back to me ","***"]
[null,"Dare","Idea","No","Medium","Check each player for arousal (erect nipple/penis). Whoever has such effect must expose it for one turn.","**"]
[null,"Dare","Idea","No","Medium","Choose a color : if any player can prove they are wearing that color bra or underwear, then you must show your bra or underwear fully.","**"]
[null,"Dare","Idea","No","Medium","Choose a new name for TARGET player. If any player fails to call that player by their new name they must kiss you!","**"]
[null,"Dare","Punishment","Yes","Hard","Clip a string tied to 2 paper cups with either binder clips or clothes pins. Then take a shower for 15 minutes","***"]
[null,"Dare","Punishment","Yes","Hard","Clothespins, clamp them to nipples or anywhere along the breasts","***"]
[null,"Dare","Idea","No","Medium","Convince TARGET player to strip by making a deal; if you can't, you must strip instead.","*"]
[null,"Dare","Idea","Yes","Soft","Dance erotically for the group.","***"]
[null,"Dare","Idea","No","Medium","Designate a player; if they want to service you, then they may do so; if not, you must STRIP naked and service yourself.","**"]
[null,"Dare","Idea","Yes","Soft","Dip your hands in the toilet.","**"]
[null,"Dare","Humiliation","Yes","Soft","Do a silly dance.","***"]
[null,"Dare","Striptease","Yes","Soft","Do a striptease. ","***"]
[null,"Dare","Denial","Yes","Kinky","Don't use the toilet for 24 hours, you can hold it, go outside or go in your pants","***"]
[null,"Dare","Idea","Yes","Soft","Draw another dare; you may, at a later turn, skip another dare.","***"]
[null,"Dare","Piss","Yes","Hard","Drink piss over webcam","***"]
[null,"Dare","Idea","Yes","Medium","Drink the closest beer; crush the can on your forehead with a loud yell. (Painful in Europe)","**"]
[null,"Dare","Striptease","No","Medium","Drop all your clothes below your waist and keep them around your ankles for FOUR turns.","***"]
[null,"Dare","Striptease","No","Medium","Everytime you laugh for the rest of the game, you must flash a private body part to the group.","**"]
[null,"Dare","Striptease","No","Medium","Exchange an article of clothing from above the waist, with TARGET player as fast as you can.","**"]
[null,"Dare","Striptease","No","Medium","Exchange an article of clothing from below the waist, with TARGET player as fast as you can.","**"]
[null,"Dare","Striptease","No","Medium","Exchange an article of clothing of your choosing, with TARGET player as fast as you can.","*"]
[null,"Dare","Striptease","No","Medium","Expose your breasts; TARGET players performs titty twister on you; you may cover back up.","***"]
[null,"Dare","Striptease","No","Medium","Expose your naked breasts for all players to see! You may cover yourself back.","**"]
[null,"Dare","Punishment","No","Medium","Fill a bathtub with ice water and ice. Remain as long as possible in the water (clothed or not).","**"]
[null,"Dare","Striptease","No","Medium","Find natural elements to cover yourself (leaves, branches, etc). Strip naked and cover yourself with whatever you found. Remain like this for a full round.","**"]
[null,"Dare","Idea","No","Medium","French kiss TARGET player.","***"]
[null,"Dare","Idea","No","Medium","French kiss the person who has gone the longest without being kissed.","**"]
[null,"Dare","Idea","No","Medium","Gently massage the bottom of TARGET player for the next FOUR turns of the game!","**"]
[null,"Dare","Idea","No","Medium","Gently massage the breasts/chest of TARGET player for the next FOUR turns of the game!","***"]
[null,"Dare","Idea","No","Medium","Gently massage the hair of TARGET player for the next FOUR turns of the game!","**"]
[null,"Dare","Idea","No","Medium","Gently massage the hands of TARGET player for the next FOUR turns of the game!","**"]
[null,"Dare","Idea","No","Medium","Gently massage the legs/thighs of TARGET player for the next FOUR turns of the game!","***"]
[null,"Dare","Idea","No","Medium","Gently massage the shoulders/back of TARGET player for the next FOUR turns of the game!","***"]
[null,"Dare","Idea","No","Medium","Gently massage your breasts.","***"]
[null,"Dare","Idea","No","Medium","Gently massage your crotch.","***"]
[null,"Dare","Idea","No","Medium","Gently STROKE any erogenous zone of TARGET player with your feet.","***"]
[null,"Dare","Idea","No","Medium","Gently STROKE any erogenous zone of TARGET player.","****"]
[null,"Dare","Punishment","Yes","Hard","Get stinging nettle and rub it on your clit and nipples.","***"]
[null,"Dare","Idea","No","Medium","Give TARGET player a bath/shower. If there is no water, pretend you are washing them. TARGET player may strip if they want to.","***"]
[null,"Dare","Idea","No","Medium","Give TARGET player a full body massage..","***"]
[null,"Dare","Idea","No","Soft","Give TARGET player a piggyback ride around the room","**"]
[null,"Dare","Piss","Yes","Kinky","Give yourself a golden shower","***"]
[null,"Dare","Idea","Yes","Soft","Give yourself a wedgie.","**"]
[null,"Dare","Idea","Yes","Soft","Go Commando for FOUR turns.","***"]
[null,"Dare","Striptease","No","Medium","Go completely naked for TWO turns.","**"]
[null,"Dare","Striptease","No","Medium","Go completely topless until someone removes an item of clothing. If you are already topless, put your top/bra back on.","****"]
[null,"Dare","Outdoor","Yes","Painful","Go out into the street naked and ask every person you see if they would like to fuck you.","*"]
[null,"Dare","Outdoor","Yes","Kinky","Go to a gym and work out with something in your pussy (girls) or ass (guys or girls)","***"]
[null,"Dare","Outdoor","Yes","Hard","Go to the park or other openpublic place, strip naked en pleasure yourself\nout in the open. Don't cover up untill you have cum","***"]
[null,"Dare","Masturbation","Yes","Soft","Go to youtube, search for the video \"lifelike and kris Menace discopolis\", take of your clothes, masturbate during the whole clip but don't cum, send me a report","**"]
[null,"Dare","Clothes","Yes","Medium","Go X number of days with out underwear","**"]
[null,"Dare","Clothes","Yes","Medium","Go X number of days with the same underwear on.","***"]
[null,"Dare","Denial","Yes","Medium","Go X number of days without masturbation","***"]
[null,"Dare","Clothes","Yes","Medium","Going X days without a bra","***"]
[null,"Dare","Striptease","Yes","Medium","Grab a blanket. Strip naked. You must wear only the blanket to cover you for one full round.","***"]
[null,"Dare","Striptease","Yes","Medium","Grab a pillow. Strip naked. You may only cover yourself with the pillow for one full round.","***"]
[null,"Dare","Idea","No","Medium","Group pours six glasses, three water, three drinks. You must drink three of them without looking.","****"]
[null,"Dare","Idea","No","Medium","Have a 3-way kiss with two other players.","****"]
[null,"Dare","Idea","No","Medium","Have another person give you a full physical (you must be nude).","**"]
[null,"Dare","Idea","No","Medium","Have any two players kiss you on the back of your knees.","**"]
[null,"Dare","Idea","No","Medium","Have any two players kiss your bottom.","**"]
[null,"Dare","Idea","No","Medium","Have any two players kiss your breasts.","****"]
[null,"Dare","Idea","No","Medium","Have any two players kiss your feet.","***"]
[null,"Dare","Idea","No","Medium","Have any two players kiss your hands.","***"]
[null,"Dare","Idea","No","Medium","Have any two players kiss your neck.","****"]
[null,"Dare","Idea","No","Medium","Have any two players kiss your thighs.","***"]
[null,"Dare","Sex","No","Medium","Have intercourse with TARGET player.","****"]
[null,"Dare","Idea","No","Soft","Have someone draw a small tattoo on your ass.","***"]
[null,"Dare","Idea","No","Soft","Have someone draw a small tattoo on your chest.","***"]
[null,"Dare","Punishment","No","Soft","Have someone give you a wedgie.","***"]
[null,"Dare","Idea","No","Soft","Have someone pour water on you (dressed or undressed). You cannot dry yourself.","***"]
[null,"Dare","Idea","No","Medium","Have TARGET player strip you; you must kiss that player once for every item thus removed. You may dress yourself back.","***"]
[null,"Dare","Idea","No","Medium","Heads or Tails. You win, TARGET player loses an item of clothing and designate new TARGET, play again. If not, you lose an item of clothing.","****"]
[null,"Dare","Idea","Yes","Soft","Hop around like a rabbit.","***"]
[null,"Dare","Idea","No","Soft","Hug every player.","***"]
[null,"Dare","Idea","Yes","Medium","Hump a pillow.","***"]
[null,"Dare","Idea","No","Medium","If TARGET player is willing, you must remove two items for every one item that player removes."]
[null,"Dare","Idea","Yes","Soft","If the first letter of your name is a f, k, m, s, or z then you must do Three more dares"]
[null,"Dare","Idea","No","Medium","If you are a girl you have to kiss another person of the same sex. Same if you are a boy. "]
[null,"Dare","Idea","Yes","Soft","Imitate a cartoon character and have everyone guess it."]
[null,"Dare","Idea","Yes","Soft","Imitate another player for 10 seconds and have everyone guess who you are!"]
[null,"Dare","Idea","No","Medium","Kiss everyone in the room."]
[null,"Dare","Idea","No","Medium","Kiss TARGET player and keep your lips locked on them for the next turn."]
[null,"Dare","Idea","No","Medium","Kiss TARGET player anywhere on their body of your choosing"]
[null,"Dare","Idea","No","Medium","Kiss TARGET player in their inner arms"]
[null,"Dare","Idea","No","Medium","Kiss TARGET player in their inner thighs"]
[null,"Dare","Idea","No","Medium","Kiss TARGET player on both sides of their neck!"]
[null,"Dare","Idea","No","Medium","Kiss TARGET player on the back of the neck."]
[null,"Dare","Idea","No","Medium","Kiss TARGET player on the back of their knees.."]
[null,"Dare","Idea","No","Medium","Kiss TARGET player on their bottom"]
[null,"Dare","Idea","No","Medium","Kiss TARGET player on their breasts"]
[null,"Dare","Idea","No","Medium","Kiss TARGET player on their calves"]
[null,"Dare","Idea","No","Medium","Kiss TARGET player on their ears (nibble)."]
[null,"Dare","Idea","No","Medium","Kiss TARGET player on their feet."]
[null,"Dare","Idea","No","Medium","Kiss TARGET player on their nipples."]
[null,"Dare","Idea","No","Medium","Kiss TARGET player on their stomach."]
[null,"Dare","Idea","No","Medium","Kiss TARGET player up and down their backside."]
[null,"Dare","Idea","No","Medium","Kiss TARGET player."]
[null,"Dare","Idea","No","Medium","Kiss TARGET player's hands."]
[null,"Dare","Idea","No","Medium","Kiss TARGET player's sex."]
[null,"Dare","Idea","No","Medium","Kiss your bare breasts."]
[null,"Dare","Idea","No","Medium","Kiss your bare knees"]
[null,"Dare","Idea","No","Medium","Lay on the floor, with arms above your head and eyes closed. Each player will slowly kiss you. Choose a player and kiss them back."]
[null,"Dare","Idea","No","Medium","Lay on your stomach and someone will sit on your butt for the next turn."]
[null,"Dare","Idea","No","Medium","Lick something decided upon by the group."]
[null,"Dare","Idea","No","Medium","Lick TARGET player's belly button."]
[null,"Dare","Idea","No","Medium","Lick TARGET player's bottom."]
[null,"Dare","Idea","No","Medium","Lick TARGET player's cheeks."]
[null,"Dare","Idea","No","Medium","Lick TARGET player's chest."]
[null,"Dare","Idea","No","Medium","Lick TARGET player's feet."]
[null,"Dare","Idea","No","Medium","Lick TARGET player's neck."]
[null,"Dare","Idea","No","Medium","Lick TARGET player's thighs"]
[null,"Dare","Idea","No","Medium","Lick the exposed nipples of everyone in the room."]
[null,"Dare","Idea","No","Medium","Lick/suck TARGET player's nipples."]
[null,"Dare","Idea","No","Medium","Lie on your back, open mouth. Others mix drink into your mouth (no pure alcool). Swallow."]
[null,"Dare","Idea","No","Medium","Lie on your back, stomach exposed. Players put a frozen food on your belly. Let it defrost."]
[null,"Dare","Idea","No","Medium","Lower your pants. Have two players kiss your legs, each taking his own."]
[null,"Dare","Idea","Yes","Medium","Make an outfit of of aluminum foil; strip naked and wear your new outfit for at least one full round."]
[null,"Dare","Idea","No","Medium","Make out with TARGET player (kissing, back rubbing, fondling)."]
[null,"Dare","Idea","Yes","Medium","Masturbate in front of the group under your underwear (or naked)."]
[null,"Dare","Idea","No","Medium","Masturbate someone in the group. If they do not orgasm after a few minutes, you must masturbate someone else."]
[null,"Dare","Masturbation","Yes","Medium","Masturbate to the most turning-on web page you know. "]
[null,"Dare","Punishment","Yes","Kinky","Masturbate tomorrow that many times that you've been phoned/sms today"]
[null,"Dare","Idea","Yes","Medium","Mix 1/3 sugar, 1/3 citrus and 1/3 alcool. Drink!"]
[null,"Dare","Idea","Yes","Medium","Mix liquor shot with tabasco. Drink."]
[null,"Dare","Idea","No","Medium","Moon everyone!"]
[null,"Dare","Idea","Yes","Soft","Perform gymnastics."]
[null,"Dare","Idea","No","Medium","Play rock-paper scissors with TARGET player. Winner gets to fondle the loser; on ties, both players fondle each other."]
[null,"Dare","Idea","No","Medium","Player is the Stripper; TARGET player is customer. Stripper must make Customer orgasm, Stripper can touch but Customer cannot touch back."]
[null,"Dare","Idea","No","Medium","Pour yourself a drink from other people's glasses. Drink it slowly."]
[null,"Dare","Punishment","Yes","Hard","Prepare 15 ice cubes, insert three and wait for the ice cubes to melt, then insert 3 more"]
[null,"Dare","Idea","No","Soft","Pretend TARGET player is a complete stranger and attempt to pick them up, within one minute!"]
[null,"Dare","Idea","Yes","Medium","Put a beer can on top of your head. Keep it there three rounds. Failing, chug it."]
[null,"Dare","Idea","No","Medium","Put a tape over your mouth. Any player can then kiss you. Keep the tape for AS MANY turns as the number of people who kissed you, maximum FOUR."]
[null,"Dare","Idea","No","Medium","Put on a white top (no bra). TARGET player soaks your chest with water. Remain like that for FOUR turns."]
[null,"Dare","Punishment","Yes","Kinky","Put on every pussylip 2 clothepins, on your clit too. Let them there for 10 minutes"]
[null,"Dare","Punishment","Yes","Kinky","Put some toothpaste on a finger or two and insert in you pussy. Don't wash it for 10 minutes."]
[null,"Dare","Idea","No","Medium","Put TARGET player's sex (in underwear or not) in your face."]
[null,"Dare","Idea","No","Medium","Put your sex (in underwear or not) in TARGET player's face."]
[null,"Dare","Idea","No","Medium","Raise all your clothes above your waist and keep them around your neck for FOUR turns."]
[null,"Dare","Idea","No","Medium","Receive a hicky (lovebite) from TARGET player anywhere on your body with exposed skin."]
[null,"Dare","Idea","No","Medium","Receive a hicky (lovebite) from the player TARGET on your belly for a maximum of 10 seconds!"]
[null,"Dare","Idea","Yes","Kinky","Record your moaning during sex and use it as ringtone"]
[null,"Dare","Idea","No","Medium","Remove a piece of clothing for each type of dollar bill ($1, $2, $5, $10, $20, $50, $100) other players can show you. Remain stripped for one full round."]
[null,"Dare","Idea","No","Medium","Remove an article of clothing of your choosing from TARGET player! If they are already naked, they must strut around the room."]
[null,"Dare","Idea","No","Medium","Remove an article of clothing of your choosing! If you are already naked, strut around the room naked."]
[null,"Dare","Idea","No","Medium","Remove anything covering your feet. After every turn, for FOUR turns, that player gets to tickle your feet."]
[null,"Dare","Idea","No","Medium","Remove anything covering your sides. After every turn, for FOUR turns, that player gets to tickle your sides."]
[null,"Dare","Idea","No","Medium","Remove anything covering your thighs. After every turn, for FOUR turns, that player gets to tickle your thighs."]
[null,"Dare","Idea","No","Medium","Remove as many pieces of clothing so you as undressed as the least dressed person in the room."]
[null,"Dare","Idea","No","Medium","Remove one article of clothing from above TARGET player's waist! If you can't, kiss that player's breasts."]
[null,"Dare","Idea","No","Medium","Remove one article of clothing from above your waist! If you can't, fondle your breasts."]
[null,"Dare","Idea","No","Medium","Remove one article of clothing from below TARGET player's waist! If you can't, kiss that player's bottom."]
[null,"Dare","Idea","Yes","Medium","Remove one article of clothing from below your waist! If you can't, show your bottom to all and fondle it."]
[null,"Dare","Idea","Yes","Medium","Remove your bra; you cannot reclaim it for the rest of the game. You may keep everything above."]
[null,"Dare","Idea","Yes","Medium","Remove your underwear; you cannot reclaim it for the rest of the game. You may keep everything above."]
[null,"Dare","Idea","Yes","Soft","Repeat the last DARE attempted."]
[null,"Dare","Striptease","Yes","Soft","reveal something to me, throw a dice (http://www.arcess.com/dice.swf) and take the picture:\n1. Nipple, 2. Belly button, 3. Ass, 4. your Bra and Panties, 5. your pretty face, 6. Face and ass, genitals or boobs (you pick)"]
[null,"Dare","Idea","Yes","Soft","Roll another dare and have TARGET player perform it; if they do, you must do it as well, only longer and more intense."]
[null,"Dare","Idea","Yes","Soft","Roll another dare; TARGET player has to perform it instead of you."]
[null,"Dare","Idea","No","Medium","Roll around naked in the grass (or on the carpet if inside). You may dress yourself back afterwards."]
[null,"Dare","Idea","No","Soft","Rub noses with the TARGET player."]
[null,"Dare","Idea","No","Medium","Rub your crotch against TARGET player's without removing any clothes."]
[null,"Dare","Punishment","Yes","Painful","Run 3 straightpins through each pussy lip, in one side and out the other."]
[null,"Dare","Idea","No","Medium","Select a forbidden word. From now on, everyone who says that word must remove an item of clothing. Word cannot be \"truth\" or \"dare\"."]
[null,"Dare","Idea","No","Medium","Select another player and both remove all clothing from above the waist, and have a full frontal body hug and kiss."]
[null,"Dare","Idea","No","Medium","Select another player and both remove all clothing from above the waist, and have a full frontal body hug."]
[null,"Dare","Idea","No","Soft","Select another player of the same sex of your choice and perform an erotic dance with them."]
[null,"Dare","Idea","No","Medium","Select one other player and demonstrate to all players your favourite sexual position, while acting out an orgasm."]
[null,"Dare","Striptease","Yes","Soft","Send me 3 pictures on different locations where you flash your breasts to the camera. One of them have to be outside."]
[null,"Dare","Striptease","Yes","Soft","send me 5 pictures of you being naked in the house."]
[null,"Dare","Idea","Yes","Soft","Send me a photo of your bedroom and give me a list of 5 things you love to do in the bedroom."]
[null,"Dare","Idea","Yes","Soft","Send me an email with a photo of your favourite toy and a picture from the internet of a toy you would like to have"]
[null,"Dare","Idea","Yes","Medium","Shaves pubes over webcam"]
[null,"Dare","Idea","Yes","Medium","Show a friend of the opposite sex some of your favorite porn and explain why you like it."]
[null,"Dare","Idea","Yes","Medium","Show all players ALL of your tattoos and or piercings!"]
[null,"Dare","Idea","No","Medium","Show all players, by spanking your own bottom, how hard you like to be spanked!"]
[null,"Dare","Idea","No","Medium","Show by example, using TARGET player's finger how you would give a blow job!"]
[null,"Dare","Idea","No","Medium","Show by example, using your own finger how you would give a blow job."]
[null,"Dare","Idea","Yes","Medium","Show TARGET player any one part of your body they want to see."]
[null,"Dare","Idea","No","Medium","Shut your eyes and spin in a circle multiple times. If you can't stand straight afterwards, strip down to nothing for one full round."]
[null,"Dare","Idea","No","Medium","Shut your eyes. Any player can fondle your body anywhere they want. If you can't guess who on the first try, another player gets to fondle you, and on…"]
[null,"Dare","Idea","Yes","Soft","Sing everything for the next FOUR turns."]
[null,"Dare","Idea","No","Soft","Sit in the lap of TARGET player for the next FOUR turns."]
[null,"Dare","Idea","Yes","Soft","Skip this dare (no one has to do it)."]
[null,"Dare","Idea","No","Soft","Slow dance with TARGET player."]
[null,"Dare","Idea","Yes","Kinky","Snort a small quantity of liquor into your nose (dangerous)."]
[null,"Dare","Idea","Yes","Soft","Speak in a foreign accent for FOUR turns."]
[null,"Dare","Idea","No","Medium","Spoon with TARGET player."]
[null,"Dare","Punishment","Yes","Hard","Squeeze a whole tube toothpaste in your pussy"]
[null,"Dare","Idea","No","Medium","Stand naked in the shower. One player covers you with toppings. The other comes and licks them off during intercourse. Group may watch at your discretion."]
[null,"Dare","Idea","No","Medium","Stand up, close your eyes and turn ten times around, then walk towards someone. You must kiss that person on the lips"]
[null,"Dare","Idea","Yes","Soft","Stick a finger in your ear, as far as you can without it hurting. Leave it there until your next turn."]
[null,"Dare","Idea","Yes","Soft","Stick a finger in your mouth, at least to the first knuckle. Leave it there until the next turn."]
[null,"Dare","Idea","Yes","Soft","Stick a finger up your nose. Leave it there until your next turn and hope no other player gets the second half of this dare!"]
[null,"Dare","Idea","Yes","Medium","Stick ice cubes in your bra."]
[null,"Dare","Idea","Yes","Medium","Stick ice cubes in your underwear."]
[null,"Dare","Striptease","No","Medium","Strip and give your clothes to the player to your left. Anytime you have to strip, an item of clothing makes its way right towards you."]
[null,"Dare","Striptease","Yes","Medium","Strip down to your underwear."]
[null,"Dare","Striptease","No","Medium","Strip naked and go outside. When you return, you may dress yourself back."]
[null,"Dare","Striptease","No","Medium","Strip naked and have someone masturbate you (a few minutes). You must not come, or else you must masturbate them back."]
[null,"Dare","Striptease","No","Medium","Strip naked and have someone take a picture of you. That player can do what they want with the picture except copy or give. They must destroy it after."]
[null,"Dare","Striptease","No","Medium","Strip naked TARGET player using only your teeth."]
[null,"Dare","Striptease","Yes","Medium","Strip naked TARGET player."]
[null,"Dare","Striptease","Yes","Medium","Strip naked, and do some exercices (sit-ups, push-ups, jumping jacks)."]
[null,"Dare","Striptease","No","Medium","Strip naked, blindfolded. Any player can feel you up (no sex). You must guess the person right or the dare is done again (until everyone has gone)."]
[null,"Dare","Striptease","Yes","Medium","Strip naked."]
[null,"Dare","Striptease","No","Medium","Strip naked. Other players hide your clothes. If you find them, you may put them back on."]
[null,"Dare","Striptease","No","Medium","Strip naked. TARGET player performs a full body massage on you (it may include sexual stimulation)."]
[null,"Dare","Striptease","Yes","Medium","Strip TARGET player down to their underwear."]
[null,"Dare","Striptease","No","Medium","Strip TARGET player with your teeth down to their underwear."]
[null,"Dare","Striptease","No","Medium","Strip, and serve a round of drinks to the group in the nude, taking orders first.."]
[null,"Dare","Striptease","No","Medium","Strip. TARGET players gives you a shower. If there is no water, he must pretend to do so. Put back any items of clothing you removed this dare."]
[null,"Dare","Idea","No","Medium","Suck, kiss and lick TARGET player's nipples, first gently, then getting harder."]
[null,"Dare","Idea","Yes","Medium","Take a nice, cold shower with your clothes on (shoes and socks off), for 5 seconds. You MUST STAND UNDER the water."]
[null,"Dare","Striptease","Yes","Soft","Take a picture of your best feature."]
[null,"Dare","Punishment","Yes","Kinky","Take a ruler, bend it and slap your pussy lips 10 times"]
[null,"Dare","Idea","Yes","Medium","Take a shot for every willing participant (up to 4) willing to strip for the round for you."]
[null,"Dare","Idea","Yes","Medium","Take a shot of (ketchup, mustard, relish, syrup, etc.)"]
[null,"Dare","Idea","Yes","Medium","Take a shot of liquor."]
[null,"Dare","Idea","Yes","Medium","Take a shot of two liquors together."]
[null,"Dare","Idea","No","Medium","Take a shower. The rest of the group watches you wash yourself. If there is no water, strip and pretend to shower. You may dress yourself back."]
[null,"Dare","Striptease","Yes","Soft","Take one picture of your nipple and your behind."]
[null,"Dare","Idea","No","Medium","TARGET player frisks you (and may remove any items in your pockets). If they miss any, they remove one item per item missed."]
[null,"Dare","Idea","No","Medium","TARGET player must guide you through sex between you and THIRD player."]
[null,"Dare","Idea","Yes","Medium","TARGET player names a color. If you are wearing that color, remove an item of clothing."]
[null,"Dare","Idea","No","Medium","TARGET player performs oral sex on you."]
[null,"Dare","Idea","No","Soft","TARGET player poses you like a dummy."]
[null,"Dare","Idea","No","Medium","TARGET player removes any number of items; everyone removes the same number; then items thus removed are put in pile and reclaimed by anyone who removed something."]
[null,"Dare","Idea","Yes","Medium","TARGET player removes as many items of clothing as they want. You must remove as many as them. They may put your clothes back on themselves."]
[null,"Dare","Idea","No","Medium","TARGET player removes bra. Wear it on your head for FOUR turns. If no one has a bra left on, fondle TARGET player's breasts."]
[null,"Dare","Idea","No","Medium","TARGET player removes bra. You must cup their breasts for FOUR turns, acting as their bra. At the end, they may put their bra back on."]
[null,"Dare","Idea","No","Medium","TARGET player removes panties. Wear them on your head for FOUR turns. If no one has panties left, fondle TARGET player's bottom."]
[null,"Dare","Idea","No","Medium","TARGET player removes underwear. You must cover their sex for FOUR turns, acting as their underwear. At the end, they may put it back on."]
[null,"Dare","Idea","No","Medium","TARGET player slaps your sex a number of times."]
[null,"Dare","Idea","No","Medium","TARGET player will gently spank you on your BARE bottom."]
[null,"Dare","Idea","No","Medium","Tell the person TARGET you why they deserve a spanking from you and spank them!"]
[null,"Dare","Idea","Yes","Medium","The group calls a shot/beer to the most drunk. You must do two."]
[null,"Dare","Idea","Yes","Medium","The group pours you a shot; you must drink it using only your mouth. Repeat on failure."]
[null,"Dare","Idea","No","Medium","Three players must strip as fast as possible. Whoever is slowest must remain naked for FOUR turns."]
[null,"Dare","Idea","No","Medium","Three players strip. One takes care of your mouth, the other your sex. The rest of the group stimulates both of them until one orgasms."]
[null,"Dare","Punishment","Yes","Kinky","Tie a shoelace around your balls and tie the other end around your big toe keep your knee at an angle and go to sleep"]
[null,"Dare","Idea","No","Medium","Trade your full set of clothes with TARGET player."]
[null,"Dare","Striptease","Yes","Soft","Try to make the same pictures like on this website:\nhttp://homemadecuties.com/watch-my-gf/teasing-her-bf/marksbookmarks.html"]
[null,"Dare","Idea","Yes","Soft","Try to put your feet behind your head "]
[null,"Dare","Idea","No","Medium","Two players kiss you : one on the mouth, the other on your bottom."]
[null,"Dare","Idea","No","Medium","Two players kiss you : one on the mouth, the other on your breasts/chest."]
[null,"Dare","Idea","No","Medium","Two players kiss you : one on the mouth, the other on your sex."]
[null,"Dare","Idea","No","Medium","Two players kiss you : one on the mouth, the other on your thighs."]
[null,"Dare","Idea","No","Medium","Two players kiss you : one on your bottom, the other on your sex."]
[null,"Dare","Idea","No","Medium","Two players kiss you : one on your bottom, the other on your thighs."]
[null,"Dare","Idea","No","Medium","Two players kiss you : one on your breasts/chest, the other on your bottom"]
[null,"Dare","Idea","No","Medium","Two players kiss you : one on your breasts/chest, the other on your sex."]
[null,"Dare","Idea","No","Medium","Two players kiss you : one on your breasts/chest, the other on your thighs."]
[null,"Dare","Idea","No","Medium","Two players kiss you : one on your thighs, the other on your sex."]
[null,"Dare","Idea","No","Medium","Unclip all the bra's worn by players using one hand, as fast as you can in a clockwise direction! Bras can be reclipped or removed, as desired."]
[null,"Dare","Idea","No","Medium","Using only your teeth, remove an item of clothing from TARGET player."]
[null,"Dare","Idea","No","Medium","While blindfolded, drop your pants and underwear; anyone in the room can visually examine your sex."]
[null,"Dare","Idea","No","Medium","While blindfolded, expose your bottom. Target player gets to play with your bottom as they want."]
[null,"Dare","Idea","No","Medium","While blindfolded, expose your top. Target player gets to play with your top as they want."]
[null,"Dare","Idea","No","Medium","You and TARGET player strip. The group puts you in an erotic sexual pose together."]
[null,"Dare","Idea","No","Soft","You are blindfolded and hands tied behind your back for the next full round."]
[null,"Dare","Idea","Yes","Medium","You become TARGET player's slave. Whenever your turn comes up, that player tells you what to do."]
[null,"Dare","Idea","Yes","Medium","You can replace one item of clothing back on to your body, if any have been removed (yours or someone else's)!"]
[null,"Dare","Idea","No","Medium","You frisk TARGET player (and may remove any items in his pockets). If you miss any, you remove one item per item missed."]
[null,"Dare","Idea","No","Soft","You must buy pizza for the group, even if food is readily available."]
[null,"Dare","Oral","No","Medium","You must perform oral sex on TARGET player, while that player performs oral sex on THIRD player. Make it a race."]
[null,"Dare","Idea","No","Medium","You must stand motionless in the middle of the room. TARGET player performs a pole dance around you."]
[null,"Dare","Idea","No","Medium","Your pants are on fire! Quick, stop what you are doing, drop your pants and roll around for 15 seconds. If you're not wearing pants, just roll on the floor."]
[null,"Dare","Idea","No","Soft","You're a slave now, you can not choose your own master. The group will! "]
[null,"Dare","Masturbation","Yes","Medium","u have to cum by rubbing your cock through your underwear and do not remove them for 5 mins after cumming."]
[null,"Dare","Masturbation","Yes","Medium","you must cum twice using 2 different random objects found within 1 meter of where you are now."]
[null,"Dare","Masturbation","Yes","Medium","orgasm with a hanging wedgie"]
[null,"Dare","Masturbation","Yes","Medium","find a bottle that is the right size and use that to masturbate"]
[null,"Dare","Masturbation","Yes","Medium","use a pillow case to make you cum you must not use your hands in anyform on you genital"]
[null,"Dare","Masturbation","Yes","Medium","cum all over yourself"]
[null,"Dare","Masturbation","Yes","Medium","Put oven gloves over both hands and then begin to masturbate using both of them"]
[null,"Dare","Masturbation","Yes","Medium","using no lube masturbate and cum.. let it run down your penis now you must orgasm again using your cum as lube"]
[null,"Dare","Masturbation","Yes","Medium","You must orgasm by humping a pillow."]
[null,"Dare","Masturbation","Yes","Medium","you must use your toilet seat and toilet to get yourself off."]
[null,"Dare","Masturbation","Yes","Medium","you must cum into a pair of underwear (socks, pants, boxers, thong, anything) and wear them straight after for half an hour"]
[null,"Dare","Masturbation","Yes","Medium","You have to cum by anal stimulation."]
[null,"Dare","Masturbation","Yes","Medium","use your pillow and sleep on it that night"]
[null,"Dare","Masturbation","Yes","Medium","cum in your hand and keep it there for 5 minutes than lick clean"]
[null,"Dare","Masturbation","Yes","Kinky","Do it in a public place"]
[null,"Dare","Masturbation","Yes","Medium","watch porn and jack off."]
[null,"Dare","Masturbation","Yes","Medium","Cum three times in 2 hours"]
[null,"Dare","Masturbation","Yes","Kinky","tie your balls up tight with an elastic and cover scrotum with clothes pegs....2fingers from your good hand finger fuck your ass while your bad hand makes you cum!!"]
[null,"Dare","Masturbation","Yes","Painful","Cover your whole genital area with hot dripping candle wax while masturbating - until you cum"]
[null,"Dare","Masturbation","Yes","Medium","Masturbate while making loud moaning sounds. Make sure you are completely naked. Fantasize about at least 10 guys and 1 girl while you masturbate, and cum while thinking of the girl. "]
[null,"Dare","Masturbation","Yes","Medium","Masturbate to lesbian porn"]
[null,"Dare","Masturbation","Yes","Medium","cum into a piece of homework and hand it in"]
[null,"Dare","Masturbation","Yes","Medium","Cum by humping something within 5m of where you are now"]
[null,"Dare","Masturbation","Yes","Medium","get a glass of milk, jerk into it, and drink it"]
[null,"Dare","Masturbation","Yes","Kinky","Cum at your window totally naked (can be an upstairs window) and cum all over your window"]
[null,"Dare","Idea","Yes","Medium","insert a pen in your ass and spank yourself with a ruler 25 times"]
[null,"Dare","Idea","Yes","Medium","put 15 ice cubes down your pants and go outside for a nice wee walk"]
[null,"Dare","Idea","Yes","Medium","roll a dice, what ever number you get you have to keep that many ice cubes in your underwear until they melt"]
[null,"Dare","Idea","Yes","Medium","Have a shower.. but with no water.. baked beans, ketchup and mayo!"]
[null,"Dare","Idea","Yes","Medium","run around house naked 10 times"]
[null,"Dare","Idea","Yes","Medium","i dare you to shave both your eyebrows off"]
[null,"Dare","Idea","Yes","Medium","cover your vibrator in penut butter shove it up your ass and turn it on"]
[null,"Dare","Piss","Yes","Kinky","I dare you to drink a pint of your pee"]
[null,"Dare","Clothes","Yes","Medium","remove your shoes for 12 hours"]
[null,"Dare","Clothes","Yes","Medium","Take off your pants for 24 hours"]
[null,"Dare","Clothes","Yes","Medium","you can't ware any socks for 3 days"]
[null,"Dare","Clothes","Yes","Medium","You can't wear any underwear for the next week"]
[null,"Dare","Clothes","Yes","Medium","you must only wear a t shirt for 24 hours"]
[null,"Dare","Humiliation","Yes","Kinky","I dare you to dress in female clothes the whole day."]
[null,"Dare","Humiliation","Yes","Kinky","I dare you to be in nothing but Bra and panties all day"]
[null,"Dare","Humiliation","Yes","Kinky","Go in the backyard and become a dog for 5 hours"]
[null,"Dare","Humiliation","Yes","Kinky","u have to go to an park in ur underwear and sit on a bench for 4 hrs and pick ur nose"]
[null,"Dare","Humiliation","Yes","Kinky","Wear the shiniest lipgloss you can find for a day, make sure you add more when it loses it's shine"]
[null,"Dare","Humiliation","Yes","Kinky","Next time your mom calls you you have to masturbate while you talk to her on the phone. Try not to moan"]
[null,"Dare","Anal","Yes","Kinky","put a pen up ur ass with mint tooth paste as lube"]
[null,"Dare","Anal","Yes","Kinky","take 3 ice cubes shove them up your ass and let them melt"]
[null,"Dare","Anal","Yes","Kinky","A carrot covered in olive oil"]
[null,"Dare","Idea","Yes","Hard","Pick up twenty thumbtacks using only your breasts, then spray rubbing alchohol are your breasts"]
[null,"Dare","Idea","Yes","Painful","dick put cloths pegs on ur balls and dick for 1 hr"]
[null,"Dare","Idea","Yes","Hard","i dare you to put toothpaste on your balls and then hit yourself in the dick. which hurt worse?"]
[null,"Dare","Idea","Yes","Painful","Tie a book to your balls...the book musnt reach the floor! go for a big jog for 10 min"]
[null,"Dare","Idea","Yes","Painful","tie a rope on your dick and balls and then tie the other end on a door handle and slam it shut just like if you were pulling a tooth out"]
[null,"Domination","Idea","Yes","Soft","A man will do more, before he has cum, because he will still be horny","****"]
[null,"Domination","Rule","Yes","Medium","A mistress will say a command that starts with Mistress says and the slave will only respond if the command begins with mistress. If he react to a direct command, there will be a penalty.","***"]
[null,"Domination","Rule","Yes","Kinky","All my choices shall be based upon whether or not they will please my Master.","***"]
[null,"Domination","Rule","Yes","Kinky","As a cleaner slave i shall use my tongue to clean the cum of my Master from the body of a female slave ","***"]
[null,"Domination","Rule","Yes","Kinky","As a helper slave i shall assist my Master in the setting of a scene or in the training and use of other female slaves.","**"]
[null,"Domination","Rule","Yes","Kinky","As a preparer slave i shall ready other female slaves for my Masters use, harden His cock for Him, or harden the cocks of others He allows me to harden.","**"]
[null,"Domination","Rule","Yes","Kinky","As a provider slave i shall offer parts of my body to those selected by my Master for their pleasure.","*"]
[null,"Domination","Punishment","Yes","Painful","Attach clothes pins or nipple clips to his nipples, balls, cock or wherever","****"]
[null,"Domination","Idea","No","Kinky","Attash a leash to hiss balls or cock ring and lead him around with that","***"]
[null,"Domination","Tease","No","Medium","Blindfold him and make him lick you to several orgasms, Take a break, come back and do it all again","****"]
[null,"Domination","Rule","Yes","Kinky","Crying and the shedding of tears at any time is good and expected for it softens my will and bonds me closer to my Master.","*"]
[null,"Domination","Denial","Yes","Medium","Don't give him permission to cum. Deny him orgasms for a long period of time.","****"]
[null,"Domination","Denial","Yes","Medium","Don't let him masturbate or touch his cock without Your permission at any time while he is Your slave.","****"]
[null,"Domination","Denial","Yes","Medium","Don't let him masturbate ot touch his cock for 4 or 5 days","****"]
[null,"Domination","Roleplaying","No","Kinky","Dress him up like the slut that he is, wear a strap-on dildo and make him beg to suck it. fuck him. (don't forget the fuck-me red lipstick!)","****"]
[null,"Domination","Punishment","Yes","Hard","Drip candle wax on him.","*****"]
[null,"Domination","Idea","No","Soft","Either order him to stay erect, or don't give him permission to have a hard on... either way, punish him if he fails!","***"]
[null,"Domination","Punishment","Yes","Hard","Get rid of one of your limits","**"]
[null,"Domination","Worship","No","Kinky","Give him a golden shower.","****"]
[null,"Domination","Idea","No","Medium","Have a few drinks before having sex and be abused during sex","****"]
[null,"Domination","Idea","Yes","Soft","Have him Address you as 'Mistress'","*****"]
[null,"Domination","Worship","No","Kinky","Have him kiss your ass, make him beg to kiss your ass. Don't let him have it right away","****"]
[null,"Domination","Worship","No","Medium","Have him kneel before You and kiss Your feet","***"]
[null,"Domination","Worship","No","Medium","Have him kneel before you and worship your feet. Make him clean between your toes and spend some time doing this","***"]
[null,"Domination","Punishment","No","Hard","Have him lick You clean after you pee","****"]
[null,"Domination","Outdoor","No","Kinky","Have sex on the desk of your boss","***"]
[null,"Domination","Roleplaying","No","Medium","Have your slave act like a dog for however long you want","***"]
[null,"Domination","Punishment","Yes","Hard","Have your slave shave his whole body","***"]
[null,"Domination","Anal","Yes","Kinky","Have your slave wear a buttplug for a long time","***"]
[null,"Domination","Rule","Yes","Kinky","i am a sexual and sensual being.","****"]
[null,"Domination","Rule","Yes","Kinky","i am free to leave my Master at any time without the fear of permanently losing Him as my Master.","***"]
[null,"Domination","Rule","Yes","Kinky","i am my Master's greatest treasure.","***"]
[null,"Domination","Rule","Yes","Kinky","i am nothing more than an object of great value - an instrument Master will use to draw out His pleasures.","**"]
[null,"Domination","Rule","Yes","Kinky","i am proud to wear upon my body the marks given to me by my Master.","***"]
[null,"Domination","Rule","Yes","Kinky","i choose willingly to be treated as my Master's property - as long as such treatment is safe and legal","**"]
[null,"Domination","Rule","Yes","Kinky","i fear no other power for my Master is always with me.","**"]
[null,"Domination","Rule","Yes","Kinky","i have much to learn in order to become a well-trained and well-behaved slave.","*****"]
[null,"Domination","Rule","Yes","Kinky","i have no will of my own other than that which falls within the context of the rules i have selected and of that which is needed to persue the ambitions i am allowed to seek out as according to the permissions i have received from my Master. i will report to Him my progress in such matters to receive His favor or His guidance in making whatever steps may be required to move ahead so that i am successful.","**"]
[null,"Domination","Rule","Yes","Kinky","i hope Master will choose to use my tongue as His towel after His shower so i may be able to worship His body.","**"]
[null,"Domination","Rule","Yes","Kinky","i must always give thanks to my Master for all i am given immediately after receiving what He has given me, for such things are gifts or privileges granted to me by Him.","**"]
[null,"Domination","Rule","Yes","Kinky","i must always remember how pleased my Master is when others delight in my sexiness as a result of my ability to show off my assets."]
[null,"Domination","Rule","Yes","Kinky","i must always respond fully both physically and verbally to whatever my Master does with me."]
[null,"Domination","Rule","Yes","Kinky","i must be attentive to the needs of my Master and always be ready to respond to them to the best of my abilities and in the unique ways in which i have chosen and have developed for Him."]
[null,"Domination","Rule","Yes","Kinky","i must be both specific and explicit in my speech."]
[null,"Domination","Rule","Yes","Kinky","i must confess to my Master when i have been naughty so that He may decide if such violations require me to be disciplined or to be punished."]
[null,"Domination","Rule","Yes","Kinky","i must never be concerned when i feel too much of my flesh is showing, in private or in the general public - however, i can ask my Master for permission as to how to handle my discomfort."]
[null,"Domination","Rule","Yes","Kinky","i must never reach orgasm without explicit permission from my Master. "]
[null,"Domination","Rule","Yes","Kinky","i must never show disrespect towards my Master in any way - no matter where i am - in his presence or not"]
[null,"Domination","Rule","Yes","Kinky","i must never tighten my body when it is being whipped, caned, cropped, slapped, paddled, belted, strapped, spanked, bullwhipped, signal whipped, or anally or vaginally pumped."]
[null,"Domination","Rule","Yes","Kinky","i must remove all of my clothing in the way i have been taught when Master commands of me to do so - regardless of who may be present and despite where it is i am - i trust my Master."]
[null,"Domination","Rule","Yes","Kinky","i must tell my Master if i have had an orgasm without His permission so that i can be properly punished for my disobedience and disrespect."]
[null,"Domination","Rule","Yes","Kinky","i realize Master may own more than one slave, if He so chooses, and that i, unless allowed by Him, may never be able to have another Master other than Him, accept by His choosing to further my training."]
[null,"Domination","Rule","Yes","Kinky","i shall learn to the endure the whippings Master gives me by using the technique of saying ' YES ' through each of His strike brought down upon my flesh."]
[null,"Domination","Rule","Yes","Kinky","i shall never think of myself as a weak person for it takes a strong female to commit to the drive inside me, to serve, to obey and to please a Master."]
[null,"Domination","Rule","Yes","Kinky","i shall wear the chains my Master gives me as a symbol of my position in life - that of bondage to Him. i shall wear them, as required, around my neck, my wrists, my ankles or around my waist."]
[null,"Domination","Rule","Yes","Kinky","i shall wear the collar my Master gives me with pride for it signifies His ownership of me and my devotion to Him."]
[null,"Domination","Rule","Yes","Kinky","i trust my Master: His responsibilities, His skills, His hunger and needs, and His concern for my safety, my emotional, psychological, social, sexual, and physical health."]
[null,"Domination","Rule","Yes","Kinky","i want to suffer for my Master in ways that please Him and that are safe for me to do so."]
[null,"Domination","Rule","Yes","Kinky","i will always listen with a strong interest in whatever my Master has to say during my training"]
[null,"Domination","Rule","Yes","Kinky","i will always sleep nude "]
[null,"Domination","Rule","Yes","Kinky","i will ask my Master for permission to satisfy whatever need i have before acting on it."]
[null,"Domination","Rule","Yes","Kinky","i will endure whatever discipline or punishment my Master gives me so i can become a better slave for Him"]
[null,"Domination","Rule","Yes","Kinky","i will give all that i am to my Master in order to become free."]
[null,"Domination","Rule","Yes","Kinky","i will never look into the eyes of my Master without his permission. To do so would be inappropriate of my position, and doing so could be interpreted by Him that i am seeking His attention or expecting Him to act - when such things are up to Him and to Him alone."]
[null,"Domination","Rule","Yes","Kinky","i will not be passive in serving my Master. i will aggressively participate in my exchange with Him"]
[null,"Domination","Rule","Yes","Kinky","i will not date others or form a relationship with others without permission and approval from my Master."]
[null,"Domination","Rule","Yes","Kinky","i will not hesitate in my obedience to my Master."]
[null,"Domination","Rule","Yes","Kinky","i will not hesitate when responding to my Master. my focus is important to my growth."]
[null,"Domination","Rule","Yes","Kinky","i will not speak to others without my Master's permission except to say to them that they will have to speak to my Master first."]
[null,"Domination","Rule","Yes","Kinky","i will not wear a pad or tampon when i am on my period without His permission - my pussy must be available for His use at all times."]
[null,"Domination","Rule","Yes","Kinky","i will serve, obey and please my Master"]
[null,"Domination","Rule","Yes","Kinky","i will thank my Master for the discipline and punishments i receive, specifying what i received and expressing the reason as to why i was given them."]
[null,"Domination","Rule","Yes","Kinky","i will work on building up my tolerances to the level my Master needs me to have, being careful not to push myself further or faster than i am ready to endure for Him, so that i may be able to expand my limitations and increase my value to Him."]
[null,"Domination","Rule","Yes","Kinky","i will worship my Master's ass only after a thorough washing of it. i shall do so hungrily, being sure to lick between the cheeks for as long as Master requires me to do so. i will use my hands to spread my Master's cheeks apart."]
[null,"Domination","Rule","Yes","Kinky","i worship my Master."]
[null,"Domination","Rule","Yes","Kinky","i worship my Master's body"]
[null,"Domination","Rule","Yes","Kinky","i worship my Master's cock, its head and its shaft, especially when it is hard or when i am given the opportunity to make it hard for Him."]
[null,"Domination","Rule","Yes","Kinky","i worship my Master's whip."]
[null,"Domination","Idea","No","Medium","If he is horny and You are not, make him strip and kneel silently in front of You and order him to stay erect. "]
[null,"Domination","Punishment","Yes","Medium","If he's really horny and bothering you, you may want to curb his interest by ordering him to jerk off 2 or 3 times in a day, or you can do this for him"]
[null,"Domination","Rule","Yes","Kinky","If i am required to be my Master's toilet, into or onto which He chooses to release the watery juices of His cock, i shall position myself to receive His personal waters by kneeling for Him, tilting my head back, opening my cunt wide, and closing my eyes so that He will delight in the display and offering of my body and of one of my orifices for Him choose upon which one to use."]
[null,"Domination","Rule","Yes","Kinky","If i am sent to another Master to serve - i will serve that Master well, as if He were my Master"]
[null,"Domination","Rule","Yes","Kinky","If it is possible to practice my basic attire in my household i will do so."]
[null,"Domination","Rule","Yes","Kinky","If required: the plug Master has provided me must be inserted deeply into my pussy before arriving at my Master's house."]
[null,"Domination","Punishment","Yes","Soft","If you have a long distance slave/master relation (like US and UK), let them wake up in the middle of the night to do some tasks for you, for you it will be a more pleasant hour"]
[null,"Domination","Punishment","Yes","Kinky","If You think he's earned an orgasm, make him cum on your feet or on your heels or in a dish or on your ass and then make him lick You clean."]
[null,"Domination","Rule","Yes","Kinky","In bondage i am made free."]
[null,"Domination","Idea","Yes","Kinky","Let him buy a vegetable that looks like his cock, let him dip it in a food substance like tomato sauce or bbq sauce and make it spicey with a spice like chili powder. Now let him suck his vegetable real hard."]
[null,"Domination","Idea","No","Soft","Let him cook and serve you a nice dinner"]
[null,"Domination","Idea","No","Soft","Let him give you a foot/back/full body massage"]
[null,"Domination","Punishment","Yes","Soft","Let him shave his legs"]
[null,"Domination","Punishment","Yes","Kinky","Let your slave add a new entry on a forum asking to give him/her punishments."]
[null,"Domination","Punishment","Yes","Hard","Let your slave wear a diaper and let him take a laxative"]
[null,"Domination","Punishment","Yes","Kinky","Make a Chastity belt with a towel and a belt or something like that. Let your slave take a viagra or some spanish fly drops and let him watch porn"]
[null,"Domination","Idea","Yes","Kinky","Make a few cum cubes by filling them twice a day for a week straight. Put them in the freezer. Make them melt in their mouth or eat the indivdual cubes."]
[null,"Domination","Anal","Yes","Kinky","Make a few cum cubes by filling them twice a day for a week straight. Put them in the freezer. See how many they can get in their ass"]
[null,"Domination","Piss","Yes","Kinky","Make a few pee cubes by filling them. Put them in the freezer. Make them melt in their mouth or eat the indivdual cubes."]
[null,"Domination","Piss","Yes","Kinky","Make a few pee cubes by filling them. Put them in the freezer. See how many they can get in their ass"]
[null,"Domination","Punishment","No","Medium","Make him do housework naked or dressed in women's clothes."]
[null,"Domination","Punishment","No","Medium","Make him hand wash your panties and lingerie"]
[null,"Domination","Worship","No","Medium","Make him lick the dildo clean"]
[null,"Domination","Punishment","No","Medium","Make him lick you clean after sex."]
[null,"Domination","Anal","No","Kinky","Make him lick you, but do it so his nose presses between Your ass cheeks. He'll be Your little brown noser and love it."]
[null,"Domination","Tease","Yes","Medium","Make him masturbate for You, make him beg for permission to cum, don't let him, punish him if he does."]
[null,"Domination","Punishment","No","Kinky","Make him polish your shoes with his tongue"]
[null,"Domination","Anal","Yes","Kinky","Make him screw himself with a dildo."]
[null,"Domination","Striptease","Yes","Soft","Make him strip naked while You keep Your clothes on"]
[null,"Domination","Punishment","Yes","Medium","Make him wear a male cock cage."]
[null,"Domination","Punishment","Yes","Medium","Make him wear Your panties or lingerie, dress him up as a little girl or a French maid."]
[null,"Domination","Piss","No","Kinky","Make you slave drink 2 liter water, then place a funnel over his penis en place the other end in his mouth. This way i'll be drinking something soon no matter what"]
[null,"Domination","Idea","Yes","Soft","Make your slave wrap themselves up in wrapping paper, to make themselves a present"]
[null,"Domination","Tease","Yes","Medium","Masturbate in front of him. Use a dildo or a vibrator."]
[null,"Domination","Punishment","Yes","Medium","Mental punishment: Don't let him/her do something he/she likes. Like watching tv or playing games. Don't let him/her do this for weeks"]
[null,"Domination","Rule","Yes","Kinky","my \"place\" is on my knees before my Master, for it is a privilege and honor to be His slave."]
[null,"Domination","Rule","Yes","Kinky","my behavior must always display a sexual content however subtle."]
[null,"Domination","Rule","Yes","Kinky","my body and mind are the property of my Master."]
[null,"Domination","Rule","Yes","Kinky","my eyes must be cast down in the presence of my Master unless i am given permission to do so otherwise. i am to focus on my behavior, waiting to act appropriately and without hesitation when directed to do so by Him."]
[null,"Domination","Rule","Yes","Kinky","my greatest felt satisfaction is realized when i know i have pleased my Master."]
[null,"Domination","Rule","Yes","Kinky","my head must be bowed down in the presence of my Master unless i am given permission to do so otherwise. i honor the position of my Master and it is important that i am not distracted in my submission to Him."]
[null,"Domination","Rule","Yes","Kinky","my legs, underarms and pussy must be kept completely shaved smooth and clean so that nothing of me is hidden from view."]
[null,"Domination","Rule","Yes","Kinky","my life is empty without a Master to please - that lost feeling inside can be real and it can grow. i may be able to step away from the hunger of my nature, but not for long, for soon it could effect every part of my life"]
[null,"Domination","Rule","Yes","Kinky","my limits do not have to be respected - i trust my Master to take me past them when He expects that i am ready - for each side of the wall of my limitations is both pleasurable and a challenge"]
[null,"Domination","Rule","Yes","Kinky","my Master will decide what my sexual orientation shall be."]
[null,"Domination","Rule","Yes","Kinky","my mouth shall only be referred to as a cunt for it will often be used as if it were a pussy"]
[null,"Domination","Rule","Yes","Kinky","my pussy and ass must be thoroughly washed and of a good aroma at all times, if even perfumed, but especially before serving my Master."]
[null,"Domination","Rule","Yes","Kinky","my safeword, verbal or otherwise, cannot be used when i am being punished. i must remember that punishment could never be very effective if i were able to control it."]
[null,"Domination","Rule","Yes","Kinky","my sex shall only be referred to as a pussy."]
[null,"Domination","Rule","Yes","Kinky","Only in complete submission to my Master shall i realize the depth of the love i have for Him"]
[null,"Domination","Rule","Yes","Kinky","Only through submission can i find my true self."]
[null,"Domination","Idea","Yes","Medium","Order him to bring himself to the edge of orgasm and stay there until you give him permission. When you give the command he must cum within 30 seconds or he will be punished or not allowed to cum at all that day."]
[null,"Domination","Idea","No","Soft","paint his finger/toe nails."]
[null,"Domination","Idea","No","Kinky","Prepare a pail filled with water and suspend the keys of a lock in it. Put this in your freezer. Put your slave naked in the garden with a collar and a rope attached to it. Secure the rope on something in your garden with a key lock. Then give her the pail from the freezer with the keys inside. The bigger the pail the longer the punishment. (keep the second keys in your pocket for safety)"]
[null,"Domination","Rule","Yes","Kinky","Privacy is a privilege - even to have it when i need to use the bathroom. i must ask for it and accept my Master's decision even when i am denied of it."]
[null,"Domination","Punishment","Yes","Hard","Put a balloon over a hose nozzel, insert it in your ass and fill the balloon with water. Remove the hose nozzel and tie a knot in the balloon. If you don't have a hoze, use a bottle and squeeze it. Force him/her at the end of the day to poop it out."]
[null,"Domination","Idea","Yes","Medium","Put the base of the dildo in his mouth and make him satisfy You with it."]
[null,"Domination","Worship","No","Soft","Put Your worn panties over his head so he can smell your odor"]
[null,"Domination","Roleplaying","No","Medium","Ride him around as your pony boy...spurs? a riding crop?"]
[null,"Domination","Tease","No","Kinky","Rub his face against your pussy, but gag him so he can't lick you"]
[null,"Domination","Idea","No","Medium","Scratch him with your finger nails."]
[null,"Domination","Outdoor","Yes","Medium","Send your partner to work wearing a piece of very sexy lingerie under his clothing, this makes a constant, discreet reminder of his or her position. Or, if you're feeling a bit more risqué:"]
[null,"Domination","Tease","No","Soft","Show your slave your panty crotch, make him smell it, but no touching"]
[null,"Domination","Worship","No","Medium","Sit on his chest and find out what he would do to be allowed to kiss your nipple. let him almost kiss it but pull away, make him beg."]
[null,"Domination","Spanking","No","Hard","Spank or whip him. (wooden spoon, hairbrush, belt, ping pong paddle...)"]
[null,"Domination","Rule","Yes","Kinky","The beginning and the ending of a day shall always be with a full body whipping and a cockfeeding to remind me of my place or to provide myself to my Master for His first and last use."]
[null,"Domination","Rule","Yes","Kinky","The needs of my Master must always come first before mine own for they offer an opportunity to please Him"]
[null,"Domination","Rule","Yes","Kinky","The only clothing i will buy and wear will be those items which my Master would find pleasing to Him: fitting to my figure and its assets, of good quality, of reasonable cost, and appropriate in His eyes and taste for the occasions i am allowed to attend with or without Him"]
[null,"Domination","Rule","Yes","Kinky","The opportunity to please my Master is very important to me and i will take every chance to seek out such opportunities to do so to the best of my abilities and in accordance to how i have been taught or allowed to do so"]
[null,"Domination","Rule","Yes","Kinky","The power of my Master fills me with awe. Just the sheer thought of Him or the hearing of His voice gives me strength."]
[null,"Domination","Tease","No","Soft","Tickle him. Pinch his nipples."]
[null,"Domination","Tease","No","Medium","Tie him down to the bed and tie his hands to his penis but do not give\n him permission to cum with harsh punishments for disobedience."]
[null,"Domination","Spanking","No","Kinky","Tie him in a chair with his knees pulled up to his shoulders - good for spanking and everything is exposed and vulnerable."]
[null,"Domination","Punishment","No","Medium","Tie him in an uncomfortable position."]
[null,"Domination","Punishment","Yes","Medium","Tie his ankles together and attach his balls to them"]
[null,"Domination","Tease","No","Kinky","Tie his balls off to something behind him so he has to tug on them to \nsmell Your panties or kiss your ass...stay just out of reach."]
[null,"Domination","Idea","No","Medium","Tie his hands behind him and have him remove your panties with his teeth"]
[null,"Domination","Roleplaying","No","Medium","Tie his hands behind his back. Have him kneel with knees spread  naked in front of You while you read or watch TV, occasionally nudging his balls or penis with Your shoes."]
[null,"Domination","Punishment","No","Medium","Tie it off in front of the sink while he does the dishes"]
[null,"Domination","Idea","Yes","Soft","Tie the hands of the slave behind their back and let them eat their food like that"]
[null,"Domination","Tease","No","Medium","Tie your slave spread eagled to the bed and tease him for hours. Use Ice cubes on his balls, warm massage oil to masturbate him slowly. Don't let him come, make him suffer."]
[null,"Domination","Rule","Yes","Kinky","To receive pleasure i must earn it."]
[null,"Domination","Punishment","Yes","Hard","Unlash a few loops of your shoe, tie the longer end of the string around you ball sack. Pull it as hard as you can for 30 seconds. When your mistress sais so, you must drop the shoe."]
[null,"Domination","Punishment","Yes","Medium","Use a paper towl roll with staples as a chastity belt and tape it on his body, Let him watch porn after taking some kind of viagra"]
[null,"Domination","Idea","No","Kinky","Use some strong string (kite string), tie a slip noose in the end and tighten it around the head of the penis, tug on it, pull it shake it, lead him with it, whatever you please."]
[null,"Domination","Clothes","Yes","Medium","Wear a thong backwards"]
[null,"Domination","Idea","Yes","Medium","When a slave wants to eat, let them cum first on there food"]
[null,"Domination","Rule","Yes","Kinky","When i am in the presence of my Master and i am free to move about i will do so in seductive and enticing ways."]
[null,"Domination","Rule","Yes","Kinky","When i am not in the presence of my Master and i have choices to make - i will perform them to the best of my abilities and within the boundaries and guidance He has allowed me."]
[null,"Domination","Rule","Yes","Kinky","When i am ready - i shall wear His rings to signify my submission to Him - one pierced through each nipple of my breasts and one through each labia of my pussy."]
[null,"Domination","Rule","Yes","Kinky","When i remove clothing from my body it must be folded neatly and placed in a small pile in front of me just ahead of my feet or my knees if i should be required to be in my kneeling position after unclothing myself."]
[null,"Domination","Rule","Yes","Kinky","When i take a shower i can do so the way i like to, but when i have finished washing i must rinse my entire body with only cold water for not less than 2 full minutes."]
[null,"Domination","Rule","Yes","Kinky","When i wear nylons i will wear them only with garters and high heels."]
[null,"Domination","Rule","Yes","Kinky","When in the presence of my Master, but not in use, i will go to the place He has selected until i am needed by Him."]
[null,"Domination","Rule","Yes","Kinky","When sitting i shall sit up straight with my legs together and my palms down on the top of my thighs"]
[null,"Domination","Rule","Yes","Kinky","When standing still i shall do so with my feet and legs together, my hands held behind my back and my head bowed down. i will remain silent in the way Master has taught me"]
[null,"Domination","Rule","Yes","Kinky","When the cock of my Master is put into my cunt and i am directed to suck it - i will do so vigorously as long as i am required to do so. my hands shall be placed on the tops of my thighs, behind my neck or held at the base of my back so that during the sucking i can use my whole body to display my hunger to my Master."]
[null,"Domination","Punishment","Yes","Kinky","Many household products can act as natural laxatives. Both store and home laxatives can be a great punishment tool."]
[null,"Domination","Punishment","Yes","Kinky","Have your slave \"wet\" themselves. "]
[null,"Domination","Punishment","Yes","Kinky","Have your slave use a pair of panties or a diaper under their clothes all day. How about ware a sock used to catch cum"]
[null,"Domination","Punishment","Yes","Kinky","Make your slave go a day with no food. "]
[null,"Domination","Punishment","Yes","Medium","Have your slave cover a part of their body in toothpaste. "]
[null,"Domination","Punishment","Yes","Medium","Ginger is a root used in cooking. When your slave shaves the skin off a small piece and inserts it into their anus it will be torture. A strong burning sensation will result. Ginger power does the same though to a much lesser degree. Be creative with this root"]
[null,"Domination","Punishment","Yes","Painful","Soap can be quite painful. Have your slave cut a half inch sliver of soap off a bar. Then have them insert the sliver into their male member. Make them keep it there for a few minutes. Urination will now be very painful. "]
[null,"Domination","Punishment","Yes","Medium","Make your slave wear a set of clothes they dislike. "]
[null,"Domination","Punishment","Yes","Soft","Make your slave pour a bodily liquid over their head in the shower. "]
[null,"Domination","Punishment","Yes","Soft","Have your slave shave their pubic region. Make them prove it with before and after pictures."]
[null,"Domination","Punishment","Yes","Kinky","Clothespins are everywhere and are a great punishment tool. One on each nipple for a predefined duration of time should work. They work great on a male member too. "]
[null,"Domination","Punishment","Yes","Kinky","Long cords and belts work very well. Have your slave punish themselves on webcam. If no webcam have the slave show the results of the punishment with a digicam. Make sure the results look painful. Have your slave take a picture of what 25 hits looks like. Then gauge your punishments from there."]
[null,"Toys","Idea","No","Medium","A pair of chopsticks, put the sticks above and below the nipples and rubber-band them together at the ends","**"]
[null,"Toys","Idea","No","Hard","An electrical fly catcher, it looks harder then it really is,,,,","*****"]
[null,"Toys","Tease","No","Medium","Brushes of various sorts are excellent on bare skin, especially when the submissive is blindfolded. For example, a soft brush such as a shaving or makeup brush can be alternated with a stiff brush such as a toothbrush on breasts, nipples, thighs, sides, and so on. An electric toothbrush makes a wonderful sex toy when used on a clitoris...","**"]
[null,"Toys","Masturbation","Yes","Medium","Bubble wrap can be used to make a great, and unusual, dildo, in virtually any width you want. Take a length of bubble wrap and roll it tightly, bubble-side out for additional texture, until it's as thick as you like. Place a condom over the roll of bubble wrap, and use a rubber band or tape to hold the end of the condom in place.","**"]
[null,"Toys","Idea","No","Medium","Dental floss, makes great nipple bondage","**"]
[null,"Toys","Idea","No","Soft","Snake bite kits, these work quite weel on nipples and you'll be suprised of the amount of suction","***"]
[null,"Toys","Idea","No","Medium","Spanking toys: wooden spoons, paint stirrers, plastic ice scrapers","****"]
[null,"Toys","Idea","No","Medium","Use a paper towl roll with staples as a chastity belt and tape it on his body","***"]
[null,"Toys","Punishment","Yes","Kinky","Stop your slave from getting aroused. Try the slave genital collar. Get a cardboard tube and cut it down so it is only an inch long. Place staples in tube so inside is spiked. Now put tape on the outside so the staples don't come out. Next, slip the spiked tube over a flaccid male member. Move all the way up and duck tape in place. Now any sexual thoughts will remind your slave who the master is. Device will hurt but will not cause damage. Prevent slave from playing with self.","****"]
[null,"Truth","Idea","Yes","Soft","Do you currently use any sex toys? If so describe what are they and what you prefer!"]
[null,"Truth","Punishment","Yes","Soft","Do you liked to be punished when you are bad?"]
[null,"Truth","Masturbation","Yes","Soft","Do you masturbate a lot? What do you use? Do you look at anything while you're doing it?"]
[null,"Truth","Idea","Yes","Soft","Do you squirt when you orgasm?"]
[null,"Truth","Idea","Yes","Soft","Do you swallow or spit?"]
[null,"Truth","Idea","Yes","Soft","Excluding yourself, who do you think is the best looking person in the room?"]
[null,"Truth","Idea","Yes","Soft","f you were blind-folded and naked, which type of fabric touching you would arouse you the most, silk or leather?"]
[null,"Truth","Idea","Yes","Soft","Guess correctly the age of TARGET player."]
[null,"Truth","Idea","Yes","Soft","Have you a special location you would like to make love to someone special?"]
[null,"Truth","Idea","Yes","Soft","Have you ever been arrested?"]
[null,"Truth","Idea","Yes","Soft","Have you ever been caught masturbating by anyone? If so, did you continue until orgasm?"]
[null,"Truth","Idea","Yes","Soft","Have you ever been cheated on?"]
[null,"Truth","Idea","Yes","Soft","Have you ever been on a blind date? If so, what was your best and worst experience?"]
[null,"Truth","Idea","Yes","Soft","Have you ever been the 'other' person?"]
[null,"Truth","Anal","Yes","Soft","have you ever been tried to have anal sex?"]
[null,"Truth","Idea","Yes","Soft","Have you ever cheated on anyone?"]
[null,"Truth","Same sex","Yes","Soft","Have you ever done anything with another man?"]
[null,"Truth","Idea","Yes","Soft","Have you ever failed to make it to the bathroom in time? If so, tell the group what happened!"]
[null,"Truth","Idea","Yes","Soft","Have you ever fantasized about watching a partner or close friend having sex with someone else?"]
[null,"Truth","Idea","Yes","Soft","Have you ever gone to a formal function without wearing underwear?"]
[null,"Truth","Idea","Yes","Soft","Have you ever had a sexual experience on a train?"]
[null,"Truth","Idea","Yes","Soft","Have you ever had an orgasm caused by stimulation other than breast or vagina?"]
[null,"Truth","Idea","Yes","Soft","Have you ever had an orgasm caused purely by breast stimulation?"]
[null,"Truth","Idea","Yes","Soft","Have you ever had botox injections?"]
[null,"Truth","Idea","Yes","Soft","Have you ever had sex with another person while your partner watched?"]
[null,"Truth","Sex","Yes","Soft","Have you ever had sex with anyone in your family aswell as cousins and really close friends?"]
[null,"Truth","Idea","Yes","Soft","Have you ever had sex with more than one person in one day?"]
[null,"Truth","Idea","Yes","Soft","Have you ever had sex with your boss? If so, descibe the experience!"]
[null,"Truth","Idea","Yes","Soft","Have you ever had sexual intercourse with two men at the same time?"]
[null,"Truth","Idea","Yes","Soft","Have you ever had sexual intercourse with two women at the same time?"]
[null,"Truth","Idea","Yes","Soft","Have you ever left your house in the morning not wearing the right clothes or forgetting to wear some parts without realizing it?"]
[null,"Truth","Idea","Yes","Soft","Have you ever made an idiot of yourself in front of someone you were interested in?"]
[null,"Truth","Idea","Yes","Soft","Have you ever PAID for sex?"]
[null,"Truth","Idea","Yes","Soft","Have you ever practiced oral sex with anything other than a penis? If so, explain what the item was! Did you use the item for anything else?"]
[null,"Truth","Idea","Yes","Soft","Have you ever received a gift from a unknown person?"]
[null,"Truth","Idea","Yes","Soft","Have you ever sent a gift to someone and remained anonoymous?"]
[null,"Truth","Idea","Yes","Soft","Have you ever skinny dipped with anyone?"]
[null,"Truth","Idea","Yes","Soft","Have you ever taken to dislike a person, because thier breasts where bigger than yours? If so,who was it and what size were the breasts?"]
[null,"Truth","Idea","Yes","Soft","Have you ever used fruit during foreplay?"]
[null,"Truth","Idea","Yes","Soft","Have you every erotically kissed another woman?"]
[null,"Truth","Idea","Yes","Soft","Have you every urinated in somebody else's bath or shower?"]
[null,"Truth","Idea","Yes","Soft","Have you experienced cybersex?"]
[null,"Truth","Idea","Yes","Soft","Have you had any cosmetic surgery or alterations?"]
[null,"Truth","Idea","Yes","Soft","Have you looked at porn websites using your computer at work?"]
[null,"Truth","Sex","Yes","Soft","how about one night stand?"]
[null,"Truth","Striptease","Yes","Soft","How big is your cock?"]
[null,"Truth","Worship","Yes","Soft","How horny do you get when you’re taking a picture for me? "]
[null,"Truth","Masturbation","Yes","Soft","How many times do you masturbate and what to?"]
[null,"Truth","Sex","Yes","Soft","How many times do you think about sex a day?"]
[null,"Truth","Masturbation","Yes","Soft","How often do you masturbate a week?"]
[null,"Truth","Worship","Yes","Soft","How would you make me cum?"]
[null,"Truth","Idea","Yes","Soft","If a close friend asked you to video tape them having sex with their partner, would you?"]
[null,"Truth","Idea","Yes","Soft","If any, what form of birth control do you practice?"]
[null,"Truth","Idea","Yes","Soft","If someone of the same sex offered to give you oral sex without having to reciprocate, would you say YES or NO?"]
[null,"Truth","Idea","Yes","Soft","If you could at no expense to you, enhance any part of your body, what would it be?"]
[null,"Truth","Sex","Yes","Soft","If you could do it with anyone, death or alive, with which person would you do it?"]
[null,"Truth","Idea","Yes","Soft","If you could have sex with anyone in the world, who would it be and why?"]
[null,"Truth","Idea","Yes","Soft","If you had 2 wishes, that would expire after 24 hours, what would the wishes be?"]
[null,"Truth","Idea","Yes","Soft","If you were a food, what would you be and how would you like to be eaten?"]
[null,"Truth","Idea","Yes","Soft","If you were blind-folded, who in the room would you want to touch and seduce you?"]
[null,"Truth","Idea","Yes","Soft","If you were given the chance to pay off all yours debts by having sex! Would you, if your partner agreed?"]
[null,"Truth","Idea","Yes","Soft","If you were invisible what is the first thing you would do?"]
[null,"Truth","Idea","Yes","Soft","If you were stranded on a desert island with one other player, who would it be and why?"]
[null,"Truth","Idea","Yes","Soft","If you were to have a new tatoo, what would it be and where would you have put on your body?"]
[null,"Truth","Idea","Yes","Soft","If you won an all expenses paid holiday, tell the group were you would go and why?"]
[null,"Truth","Idea","Yes","Soft","In a clockwise direction, name all players after a drink or cocktail!"]
[null,"Truth","Idea","Yes","Soft","Name some places or settings you like to be sexual in!"]
[null,"Truth","Idea","Yes","Soft","Recall your first experience, if ever using a sex toy! If so, describe the experience and the toy used!"]
[null,"Truth","Idea","Yes","Soft","Select your sexual personality? Straight, Bi-Curious, Bi-Sexual, Lesbian or open minded?"]
[null,"Truth","Idea","Yes","Soft","Tell all players about your best sexual experience!"]
[null,"Truth","Idea","Yes","Soft","Tell all players about your wildest sexual escapade!"]
[null,"Truth","Idea","Yes","Soft","Tell all players about your worst sexual experience!"]
[null,"Truth","Idea","Yes","Soft","Tell all players which person of the same sex as you, you would have a sexual experience with!"]
[null,"Truth","Idea","Yes","Soft","Tell all players which pop star you would like to have a sexual experience with!"]
[null,"Truth","Idea","Yes","Soft","Tell all players which television star you would like to have a sexual experience with!"]
[null,"Truth","Idea","Yes","Soft","Tell all players your favorite sexual phase (during sex)."]
[null,"Truth","Idea","Yes","Soft","Tell all players, 3 erotic things that really turn you on!"]
[null,"Truth","Idea","Yes","Soft","Tell all the players your favorite WORD, out loud!"]
[null,"Truth","Idea","Yes","Soft","Tell all the players your most favourite sexual WORD, out loud!"]
[null,"Truth","Idea","Yes","Soft","Tell all the players your most hated WORD, out loud!"]
[null,"Truth","Worship","Yes","Soft","Tell me one of your fantasies. "]
[null,"Truth","Idea","Yes","Soft","Tell me what was the most kinky thing you’ve done"]
[null,"Truth","Sex","Yes","Soft","Tell me what your favourite position is."]
[null,"Truth","Idea","Yes","Soft","Tell the group about a particularly dramatic kissing experience you have ever had, that was not with your present partner!"]
[null,"Truth","Idea","Yes","Soft","Tell us the kinds of things you would like a sexual partner to say during foreplay?"]
[null,"Truth","Idea","Yes","Soft","What age was the oldest person you have ever had sexual intercourse with?"]
[null,"Truth","Idea","Yes","Soft","What clothes or costumes do you like your partner to wear to make them sexier to you?"]
[null,"Truth","Idea","Yes","Soft","What clothing do you usually sleep in?"]
[null,"Truth","Idea","Yes","Soft","What colour and kind of underwear do you prefer to wear?"]
[null,"Truth","Idea","Yes","Soft","What do you like to Day-Dream about?"]
[null,"Truth","Idea","Yes","Soft","What do you think is the best and worst things about group sex?"]
[null,"Truth","Idea","Yes","Soft","What hair and eye colours turns you on?"]
[null,"Truth","Idea","Yes","Soft","What has been the longest period you have not shaven your legs as an adult!"]
[null,"Truth","Idea","Yes","Soft","What is now your favorite cocktail?"]
[null,"Truth","Idea","Yes","Soft","What is the best prank you have pulled?"]
[null,"Truth","Idea","Yes","Soft","What is the first thing you notice when you meet a person of the opposite sex?"]
[null,"Truth","Idea","Yes","Soft","What is the first thing you notice when you meet a person of the same sex?"]
[null,"Truth","Idea","Yes","Soft","What is the kinkiest thing you ever did?"]
[null,"Truth","Idea","Yes","Soft","What is the meanest punishment you ever received, and what was it for?"]
[null,"Truth","Idea","Yes","Soft","What is the most annoying habit that a romantic partner of your's has ever had?"]
[null,"Truth","Idea","Yes","Soft","What is the most important quality to you, to have in a romantic partner?"]
[null,"Truth","Sex","Yes","Soft","What is the naughtiest thing you have done when having sex?"]
[null,"Truth","Idea","Yes","Soft","What is the one talent you wish you possessed?"]
[null,"Truth","Idea","Yes","Soft","What is the strangest object you have ever used to masterbate with?"]
[null,"Truth","Idea","Yes","Soft","What is the worst thing about being your sex?"]
[null,"Truth","Idea","Yes","Soft","What is your favourite erotic colour for a bedroom to have hot passionate sex in?"]
[null,"Truth","Idea","Yes","Soft","What is your most hated sexual position?"]
[null,"Truth","Idea","Yes","Soft","What is your most outrageous fantasy?"]
[null,"Truth","Idea","Yes","Soft","What is your most romantic memory?"]
[null,"Truth","Idea","Yes","Soft","What item of clothing worn by any player turns you on?"]
[null,"Truth","Idea","Yes","Soft","What physical characteristics do you usually find sexy?"]
[null,"Truth","Idea","Yes","Soft","What pick up line would work on you?"]
[null,"Truth","Idea","Yes","Soft","What piercing would look sexy on you?"]
[null,"Truth","Idea","Yes","Soft","What question would you most dread to be asked?"]
[null,"Truth","Idea","Yes","Soft","What scares you the most?"]
[null,"Truth","Idea","Yes","Soft","What sexual personality would you like your partner to be? Straight, Bi-Curious, Bi-Sexual or open minded?"]
[null,"Truth","Idea","Yes","Soft","What size was the largest penis you ever held?"]
[null,"Truth","Idea","Yes","Soft","What size was the smallest penis you ever held?"]
[null,"Truth","Idea","Yes","Soft","What would you prefer in a romantic partner: a big heart or a big penis?"]
[null,"Truth","Idea","Yes","Soft","What would your 'Porn Star' name be?"]
[null,"Truth","Idea","Yes","Soft","What's your favorite thing about your body?"]
[null,"Truth","Idea","Yes","Soft","When was the first time you got really drunk?"]
[null,"Truth","Idea","Yes","Soft","When was the first time you had sex with someone you really cared about?"]
[null,"Truth","Idea","Yes","Soft","When you were a teenager, what did you really want to be when you left School?"]
[null,"Truth","Idea","Yes","Soft","When, where and how was the very first time you had an orgasm!"]
[null,"Truth","Idea","Yes","Soft","Where and what time of the day, do you like to have sex other than the bedroom?"]
[null,"Truth","Idea","Yes","Soft","Where, what and when was the first item you stole without paying for it?"]
[null,"Truth","Idea","Yes","Soft","Which colleague have you ever had a fantasy about?"]
[null,"Truth","Idea","Yes","Soft","Which job, do you think you would be better at: a 'Porn' movie Director or a 'Porn' movie Writer?"]
[null,"Truth","Idea","Yes","Soft","Which nationality arouses you? Tell the group the reasons why?"]
[null,"Truth","Idea","Yes","Soft","Which person in the room do you think is most likely to flirt with themselves in the mirror?"]
[null,"Truth","Idea","Yes","Soft","Which popstar do you think you resemble?"]
[null,"Truth","Idea","Yes","Soft","Which relationship appeals more to you : wild passionate or soft sensual?"]
[null,"Truth","Idea","Yes","Soft","Which super power do you wish you had?"]
[null,"Truth","Idea","Yes","Soft","Which work colleague or colleagues have you ever had a fantasy about?"]
[null,"Truth","Idea","Yes","Soft","Who was the first person that you felt sexual attraction with? State when, where and why: a) at school? b) at work? c) within this group of players?"]
[null,"Truth","Idea","Yes","Soft","Would you ever consider joining an orgy?"]
[null,"Truth","Idea","Yes","Soft","Would you let your partner videotape the two of you having sex?"]
[null,"Truth","Idea","Yes","Soft","Would you like to shag your partner with a strap-on?"]
[null,"Truth","Idea","Yes","Soft","You enter a room were there is a gang-bang going on! Do you leave, watch or join in?"]
[null,"Truth","Idea","Yes","Soft","You enter a room where two girls and two guys are having sex all together! They notice you and then continue, do you then leave, watch or join them?"]
[null,"Website","Sex","No","Medium","A few more positions to check: http://www.menshealth.com/sexpositionmaster/seatedmissionary.html ","***"]
[null,"Website","Anal","Yes","Kinky","Enema: http://bestslavetraining.com/enema.htm ","****"]
[null,"Website","Idea","No","Medium","How to manage a slave: http://bestslavetraining.com/Slavemgt.htm","***"]
[null,"Website","Idea","No","Medium","How to present to her master: http://bestslavetraining.com/PRESENT.htm","****"]
[null,"Website","Gallery","Yes","Medium","http://babesandbitches.net","****"]
[null,"Website","Gallery","Yes","Kinky","http://bdsm.sexafraid.com/","**"]
[null,"Website","Gallery","Yes","Kinky","http://bdsm-portal.net/","*"]
[null,"Website","Gallery","Yes","Soft","http://celebritytitsandass.com/xxx_celebrityindex.htm","***"]
[null,"Website","Gallery","Yes","Medium","http://cleoteener.com/","**"]
[null,"Website","Gallery","Yes","Hard","http://hqfemdom.com/","****"]
[null,"Website","Gallery","Yes","Hard","http://lady-domina.com/","***"]
[null,"Website","Gallery","Yes","Kinky","http://meninpain.femdompornvideos.com/","***"]
[null,"Website","Gallery","Yes","Soft","http://newhegrenudes.com/","*****"]
[null,"Website","Gallery","Yes","Medium","http://www.2hot4blog.com/category/porn/","*****"]
[null,"Website","Gallery","Yes","Medium","http://www.adult-series.com/","***"]
[null,"Website","Gallery","Yes","Medium","http://www.ah-me.com/mainpage.shtml","**"]
[null,"Website","Gallery","Yes","Soft","http://www.allmygals.com/","*****"]
[null,"Website","Gallery","Yes","Medium","http://www.amateur-hard.com/home.php","***"]
[null,"Website","Gallery","Yes","Soft","http://www.auroporn.com/celebs/pics.shtml","****"]
[null,"Website","Gallery","Yes","Medium","http://www.blushingbeauties.com/","***"]
[null,"Website","Gallery","Yes","Kinky","http://www.bondageco.com/","****"]
[null,"Website","Gallery","Yes","Kinky","http://www.bondagepaper.com/","****"]
[null,"Website","Gallery","Yes","Medium","http://www.book-mark.net/mark.html","*****"]
[null,"Website","Gallery","Yes","Soft","http://www.celebritybeta.com/","****"]
[null,"Website","Gallery","Yes","Soft","http://www.cherrynudes.com/","*****"]
[null,"Website","Gallery","Yes","Hard","http://www.crocoporn.com/st/niches/femaledomination.shtml","****"]
[null,"Website","Gallery","Yes","Hard","http://www.domination-feet.com/","**"]
[null,"Website","Gallery","Yes","Medium","http://www.el-ladies.com/","***"]
[null,"Website","Gallery","Yes","Hard","http://www.femdom7.com/?ref=girlincontrol.com","***"]
[null,"Website","Gallery","Yes","Hard","http://www.femdomattic.com/","*****"]
[null,"Website","Gallery","Yes","Hard","http://www.femdom-bondage-videos.com/?ref=girlincontrol.com","***"]
[null,"Website","Gallery","Yes","Hard","http://www.femdomcellar.com/?ref=girlincontrol.com","****"]
[null,"Website","Gallery","Yes","Hard","http://www.femdomlibrary.com/?ref=girlincontrol.com","***"]
[null,"Website","Gallery","Yes","Hard","http://www.femdomtgp.net/tgp.html","**"]
[null,"Website","Gallery","Yes","Hard","http://www.femdomtower.com/","****"]
[null,"Website","Gallery","Yes","Medium","http://www.freegirlies.com/","***"]
[null,"Website","Gallery","Yes","Soft","http://www.freeones.com/","****"]
[null,"Website","Gallery","Yes","Medium","http://www.galleries4free.com/","*****"]
[null,"Website","Gallery","Yes","Soft","http://www.gallerygalore.net/","*****"]
[null,"Website","Gallery","Yes","Hard","http://www.girlincontrol.com/","****"]
[null,"Website","Gallery","Yes","Medium","http://www.hardcorepub.com/","***"]
[null,"Website","Gallery","Yes","Medium","http://www.lovefuckk.com/","***"]
[null,"Website","Gallery","Yes","Hard","http://www.megafemdom.com/?ref=girlincontrol.com","***"]
[null,"Website","Gallery","Yes","Soft","http://www.modelshrines.com/home.php","*****"]
[null,"Website","Gallery","Yes","Hard","http://www.newfemdom.com/?ref=girlincontrol.com","***"]
[null,"Website","Gallery","Yes","Medium","http://www.passionclips.com/","***"]
[null,"Website","Gallery","Yes","Hard","http://www.planetclimax.com/galleries/femdom.html","**"]
[null,"Website","Gallery","Yes","Soft","http://www.pmates.com/","*****"]
[null,"Website","Gallery","Yes","Soft","http://www.pornstar-world.net/","**"]
[null,"Website","Gallery","Yes","Hard","http://www.russian-mistress.org/","**"]
[null,"Website","Gallery","Yes","Soft","http://www.silentpix.com/sexy-babes/celebrities.php","****"]
[null,"Website","Gallery","Yes","Soft","http://www.smoothgals.com/","****"]
[null,"Website","Gallery","Yes","Soft","http://www.starcelebs.com/","*****"]
[null,"Website","Gallery","Yes","Hard","http://www.strictdomina.com/?ref=girlincontrol.com","**"]
[null,"Website","Gallery","Yes","Medium","http://www.submityourex.com/","***"]
[null,"Website","Gallery","Yes","Kinky","http://www.sunporno.com","****"]
[null,"Website","Gallery","Yes","Soft","http://www.superglamdolls.com/","****"]
[null,"Website","Gallery","Yes","Medium","http://www.thumbzilla.com/main.php","****"]
[null,"Website","Gallery","Yes","Hard","http://www.tubesexclips.com/?free","*"]
[null,"Website","Gallery","Yes","Medium","http://www.twilightsex.com/","*****"]
[null,"Website","Gallery","Yes","Medium","http://www.ultradonkey.com/","***"]
[null,"Website","Gallery","Yes","Medium","http://www.whataporn.com/pics.shtml","**"]
[null,"Website","Gallery","Yes","Medium","http://www.youngleafs.com/tgp.shtml","***"]
[null,"Website","Idea","Yes","Medium","Slave positions: http://bestslavetraining.com/slavepositions.htm","****"]
[null,"Website","Idea","Yes","Kinky","Training techniques: http://bestslavetraining.com/TrainingTech.htm","*****"]
[null,"Website","Forum","Yes","Soft","www.getdare.com","*****"]
[null,"Website","Gallery","Yes","Soft","www.worldsex.com","*****"]

{"sheet":"Random Punishment","index":1,"n_rows":108,"n_cols":27,"rows_kept":108,"cut":false,"hidden":false,"merged":[[27,3,27,11],[33,1,40,10],[0,16,7,16],[0,17,7,17],[0,18,7,18],[1,0,1,11],[31,0,31,7],[13,2,13,5],[22,2,22,5],[5,0,5,5],[5,8,5,9],[11,0,11,3],[20,0,20,3],[16,0,16,3],[28,3,28,11],[25,0,25,4],[0,19,7,19],[1,25,7,25],[1,26,7,26],[0,25,0,26],[0,13,7,13],[0,14,7,14],[0,15,7,15]]}
[null,null,null,null,null,null,null,null,null,null,null,null,null,"Number","Device","Time","Time 2","At the end…","Number of strokes/hours/times","Punishment event",null,null,null,null,null,"Bonus tasks"]
["Punishment Generator",null,null,null,null,null,null,null,null,null,null,null,null,null,null,null,null,null,null,null,null,null,null,null,null,"Number","Task"]
[]
[]
[]
["Your random numbers are:",null,null,null,null,null,null,null,"Bonus Number"]
[]
[]
[null,{"$f":"RANDBETWEEN(1,50)","v":17},15,13,19,29,{"$f":"RANDBETWEEN(1,50)","v":14},null,null,{"$f":"RANDBETWEEN(1,100)","v":29},null,null,null,1,"HolyTrainer",1,"Months","Be released",1,"Punishment fucks",null,null,null,null,null,1,"Over the knee spanking with your bare hand - 20 lashes. Sub must count out each strike and ask for another."]
[null,null,null,null,null,null,null,null,null,null,null,null,null,2,"Seedpod",2,"Weeks","Be released",2,"Strokes of the cane on your back and arse",null,null,null,null,null,2,"Over the knee spanking with a thuddy implement (paddle, wooden hairbrush, etc) - 20 lashes. Sub must count out each strike and ask for another."]
[null,null,null,null,null,null,null,null,null,null,null,null,null,3,"HolyTrainer",3,"Days","Be released",3,"Strokes of the cane on your arse",null,null,null,null,null,3,"Over the knee spanking with a stingy implement (cane, thin crop, switch, etc) - 20 lashes. Sub must count out each strike and ask for another."]
["This means that you will wear the:",null,null,null,null,null,null,null,null,null,null,null,null,4,"Seedpod",4,"Weeks","Be released",4,"cock whips with a material of Masters choice",null,null,null,null,null,4,"Sub must kneel on uncooked rice for 30 minutes with his hands placed behind his head. Then he must clean up the rice."]
[null,null,null,null,null,null,null,null,null,null,null,null,null,5,"HolyTrainer",5,"Weeks","Be released",5,"hours in tight bondage & strokes of the cane",null,null,null,null,null,5,"Sub must perform household cleaning with a 3cm chain linking it's ankles and a 2cm chain linking its wrists - balls tied to chains."]
[null,null,{"$f":"VLOOKUP(B9,$N$9:$T$58,2)","v":"HolyTrainer"},null,null,null,null,null,null,null,null,null,null,6,"Seedpod",6,"Days","Be released",6,"hours chained up as and where Master chooses & strokes of the cane",null,null,null,null,null,6,"Write a very detailed description of a fantasy of his, including those involved without using names, setting, process, etc. from beginning to end. Once that task is complete have him post it online for all to read."]
[null,null,null,null,null,null,null,null,null,null,null,null,null,7,"HolyTrainer",7,"Weeks","Be released",7,"hours of arse development work & strokes of the cane",null,null,null,null,null,7,"Caning the soles of his feet - 10 firm lashes."]
[null,null,null,null,null,null,null,null,null,null,null,null,null,8,"Seedpod",8,"Weeks","Be released",8,"hours of cock hole development work & cock whips",null,null,null,null,null,8,"Place clothespins on his nipples for 30 minutes a day for a week."]
["For:",null,null,null,null,null,null,null,null,null,null,null,null,9,"HolyTrainer",9,"Days","Be released",9,"unpleasent/painful/humiliating things of Master's choice",null,null,null,null,null,9,"Place clothespins on his cock, scrotum, etc. for 30 minutes each day for a week."]
[null,null,{"$f":"VLOOKUP(C9,$N$9:$T$58,3)","v":15},{"$f":"VLOOKUP(D9,$N$9:$T$58,4)","v":"Weeks"},null,null,null,null,null,null,null,null,null,10,"Seedpod",10,"Weeks","Be released",10,"hours gagged in silence & strokes for the cane to the soles of the feet",null,null,null,null,null,10,"Tie his balls to his big toe for 24 hours."]
[null,null,null,null,null,null,null,null,null,null,null,null,null,11,"HolyTrainer",11,"Weeks","Be released",11,"grounded days & strokes to the back",null,null,null,null,null,11,"Stand in the corner for 30 minutes but holding a coin against one of the walls with his nose. If it falls, select another punishment."]
[null,null,null,null,null,null,null,null,null,null,null,null,null,12,"Seedpod",12,"Days","Be released",12,"strokes to your chest",null,null,null,null,null,12,"Forced cold shower for however long you feel nessecary."]
["At the end ot this period you will:",null,null,null,null,null,null,null,null,null,null,null,null,13,"HolyTrainer",13,"Weeks","Be released",13,"strokes to your feet",null,null,null,null,null,13,"Chain him to a broom by a collar and a chain that's just too short to stand comfortably while swiffering. Have him clean the kitchen to your satisfaction while he's chained up."]
[null,null,null,null,null,null,null,null,null,null,null,null,null,14,"Seedpod",14,"Weeks","Be released",14,"hours of fucking yourself with a dildo & strokes of the cane to the arse",null,null,null,null,null,14,"Urinate on him while he is in a kneeling position. Then have him clean up."]
[null,null,{"$f":"VLOOKUP(E9,$N$9:$T$58,5)","v":"Be released"},null,null,null,null,null,null,null,null,null,null,15,"HolyTrainer",15,"Days","Be released",15,"unpleasent/painful/humiliating things of Master's choice",null,null,null,null,null,15,"he must act as an object such as a foot stool, coffee table, etc for 5 hours."]
[null,null,null,null,null,null,null,null,null,null,null,null,null,16,"Seedpod",16,"Months","Load up this generator and start again",16,"unpleasent/painful/humiliating things of Master's choice",null,null,null,null,null,16,"Bathroom use control for 24 hours."]
[null,null,null,null,null,null,null,null,null,null,null,null,null,17,"HolyTrainer",17,"Weeks","Be released",17,"Punishment fucks & cock whippings",null,null,null,null,null,17,"Make him go to the grocery store and buy the largest cucumber he can find and a bottle of lube. Use it on him"]
["You will also receive up to (or more if Master sees fit) :",null,null,null,null,null,null,null,null,null,null,null,null,18,"Seedpod",18,"Weeks","Load up this generator and start again",18,"Punishment fucks & strokes to the arse",null,null,null,null,null,18,"Make him serve your friends when they come over and prohibit him from making eye contact. If he were extra bad, make him do this wearing a nappy/chastity shorts and no trousers."]
[null,null,null,null,null,null,null,null,null,null,null,null,null,19,"HolyTrainer",19,"Months","Be released",19,"Strokes of the cane on your back and arse",null,null,null,null,null,19,"Sensory deprivation."]
[null,null,{"$f":"VLOOKUP(F9,$N$9:$T$58,6)","v":29},{"$f":"VLOOKUP(G9,$N$9:$T$58,7)","v":"hours of fucking yourself with a dildo & strokes of the cane to the arse"},null,null,null,null,null,null,null,null,null,20,"Seedpod",20,"Weeks","Load up this generator and start again",20,"Strokes of the cane on your arse",null,null,null,null,null,20,"Write his infraction on his body in marker, take pictures and post on the internet for all to see (no face shots) & make him keep a copy in his wallet for a week."]
[null,null,null,"This can be carried out over a number of days if allowed",null,null,null,null,null,null,null,null,null,21,"HolyTrainer",21,"Days","Be released",21,"cock whips with a material of Masters choice",null,null,null,null,null,21,"Sub will pose for a photo shoot in any ways the owenr wants (no face shots on the internet)."]
[null,null,null,null,null,null,null,null,null,null,null,null,null,22,"Seedpod",22,"Months","Load up this generator and start again",22,"hours in tight bondage & CP of Master's choice",null,null,null,null,null,22,"Write dirty things on his body, such as 'Dirty Slut' or 'Cock Whore,' and make him run an errand wearing a long coat with nothing underneath. he will not be visibly nude but he will know what people would see if the coat were to come off."]
["BONUS",null,null,null,null,null,null,null,null,null,null,null,null,23,"HolyTrainer",23,"Weeks","Be released",23,"hours chained up as and where Master chooses & CP of Master's choice",null,null,null,null,null,23,"Schedule an appointment for him to have a sack, back and crack wax done. The sting will remind him of his disobedience."]
["Thses have been contributed by members of the public & will be carried out as well.",null,null,null,null,null,null,null,null,null,null,null,null,24,"Seedpod",24,"Days","Load up this generator and start again",24,"hours of arse development work & CP of Master's choice",null,null,null,null,null,24,"Order him to bring himself to the edge of orgasm and stay there until you give him permission. When you give the command he must cum within 30 seconds or he will be punished multiple times."]
[null,null,null,null,null,null,null,null,null,null,null,null,null,25,"HolyTrainer",25,"Months","Be released",25,"hours of cock hole development work & CP of Master's choice",null,null,null,null,null,25,"Have him piss in his shoes"]
[null,{"$f":"VLOOKUP(J9,Z9:AA108,2)","v":"make him make him cum in his food before he can eat his meal. Or use your cum."},null,null,null,null,null,null,null,null,null,null,null,26,"Seedpod",26,"Weeks","Load up this generator and start again",26,"unpleasent/painful/humiliating things of Master's choice",null,null,null,null,null,26,"Rub his face in your crotch but gag him so that he cannot lick you."]
[null,null,null,null,null,null,null,null,null,null,null,null,null,27,"HolyTrainer",27,"Days","Be released",27,"hours gagged in silence & CP of Master's choice",null,null,null,null,null,27,"Tie him in a chair with his knees pulled up to his shoulders - good for spanking and everything is exposed and vulnerable."]
[null,null,null,null,null,null,null,null,null,null,null,null,null,28,"Seedpod",28,"Months","Load up this generator and start again",28,"Strokes of the cane ",null,null,null,null,null,28,"Tie his hands behind his back and have him kneel with knees spread naked in front of you while you read or watch TV, occasionally nudging his genitals with your shoes."]
[null,null,null,null,null,null,null,null,null,null,null,null,null,29,"HolyTrainer",29,"Weeks","Be released",29,"strokes to your chest and balls",null,null,null,null,null,29,"make him make him cum in his food before he can eat his meal. Or use your cum."]
[null,null,null,null,null,null,null,null,null,null,null,null,null,30,"Seedpod",30,"Days","Load up this generator and start again",30,"strokes to your feet",null,null,null,null,null,30,"Have him take a shower in any way he like to, but when he are finished make him rinse his entire body in cold water for 2 minutes."]
[null,null,null,null,null,null,null,null,null,null,null,null,null,31,"HolyTrainer",31,"Months","Be released",31,"hours of fucking yourself with a dildo & CP of Master's choice",null,null,null,null,null,31,"Next time he shaves, make him shave 'slave' into his bodyhair."]
[null,null,null,null,null,null,null,null,null,null,null,null,null,32,"Seedpod",32,"Weeks","Load up this generator and start again",32,"unpleasent/painful/humiliating things of Master's choice",null,null,null,null,null,32,"Get him a tan - put the word 'slave' on him in sun block first"]
[null,null,null,null,null,null,null,null,null,null,null,null,null,33,"HolyTrainer",33,"Days","Be released",33,"unpleasent/painful/humiliating things of Master's choice",null,null,null,null,null,33,"Insert a 20 ice cubes into his anus."]
[null,null,null,null,null,null,null,null,null,null,null,null,null,34,"Seedpod",34,"Months","Load up this generator and start again",34,"Punishment fucks & CP of Master's choice",null,null,null,null,null,34,"Pit something unpleasent/prickly/stingy in his chastity device"]
[null,null,null,null,null,null,null,null,null,null,null,null,null,35,"HolyTrainer",35,"Weeks","Be released",35,"Punishment fucks & CP of Master's choice",null,null,null,null,null,35,"Cum on his face and make him perform household chores while the cum dries on his face. he cannot wash it off until you give him permission."]
[null,null,null,null,null,null,null,null,null,null,null,null,null,36,"Seedpod",36,"Days","Load up this generator and start again",36,"Strokes of the cane on your back and arse",null,null,null,null,null,36,"The next time an unaware family member calls, make him fuck himself with a dildo whilst speaking to them."]
[null,null,null,null,null,null,null,null,null,null,null,null,null,37,"HolyTrainer",37,"Months","Be released",37,"Strokes of the cane on your arse and balls/cock",null,null,null,null,null,37,"Pick up twenty thumbtacks using only his ass, then spread rubbing alchohol over his ass."]
[null,null,null,null,null,null,null,null,null,null,null,null,null,38,"Seedpod",38,"Weeks","Load up this generator and start again",38,"cock whips with a material of Masters choice",null,null,null,null,null,38,"he must use his tongue as a towel upon your body after you have finished taking a shower. In this way, he will whorship your body."]
[null,null,null,null,null,null,null,null,null,null,null,null,null,39,"HolyTrainer",39,"Days","Be released",39,"hours in tight bondage & strokes of the cane",null,null,null,null,null,39,"Take him out in public for the day. During this time, he must whisper in your ear the things he want. Example: At a restaurant he must whisper to you his order. he cannot speak for himself."]
[null,null,null,null,null,null,null,null,null,null,null,null,null,40,"Seedpod",40,"Months","Load up this generator and start again",40,"hours chained up as and where Master chooses & strokes to your arse/cock/balls",null,null,null,null,null,40,"he must take a plastic ruler, bend it, and release it so it slaps his balls 10 times. he's not good enough for you to spank him."]
[null,null,null,null,null,null,null,null,null,null,null,null,null,41,"HolyTrainer",41,"Weeks","Be released",41,"hours of arse development work & strokes to your arse/cock/balls",null,null,null,null,null,41,"Record him fucking himselves with a dildo & set it as his ringtone."]
[null,null,null,null,null,null,null,null,null,null,null,null,null,42,"Seedpod",42,"Days","Load up this generator and start again",42,"hours of cock hole development work & strokes to your arse/cock/balls",null,null,null,null,null,42,"If consentual company is visiting, have him masturbate or fuck himself, but not orgasm, in the middle of the room for all to see."]
[null,null,null,null,null,null,null,null,null,null,null,null,null,43,"HolyTrainer",43,"Months","Be released",43,"unpleasent/painful/humiliating things of Master's choice",null,null,null,null,null,43,"Empty your bladder, then cut a sliver of soap off and insert it into your dick. Now masturbate. You'll have a very painful orgasm ans soapy cum, the pain will last for hours"]
[null,null,null,null,null,null,null,null,null,null,null,null,null,44,"Seedpod",44,"Weeks","Load up this generator and start again",44,"hours gagged in silence & strokes to your back/cock/balls",null,null,null,null,null,44,"2 litre enema, insert your butt plug and hold for 15 minutes."]
[null,null,null,null,null,null,null,null,null,null,null,null,null,45,"HolyTrainer",45,"Days","Be released",45,"grounded days & strokes to your arse/cock/balls",null,null,null,null,null,45,"Get your slave to kneel on all four. Put an hook his ass and connect it with a rope to the head bending backwards. The more he want to lower his head, the more it'll hurt."]
[null,null,null,null,null,null,null,null,null,null,null,null,null,46,"Seedpod",46,"Months","Load up this generator and start again",46,"strokes to your chest and arse",null,null,null,null,null,46,"Place an advert on Squirt offering his services for anyone who wants to (safely!) fuck him. Try to keep him as busy as possible for 24 hours."]
[null,null,null,null,null,null,null,null,null,null,null,null,null,47,"HolyTrainer",47,"Weeks","Be released",47,"strokes to your feet",null,null,null,null,null,47,"Hog tied for as long as owner sees fit. (wrists and ankles tied together)"]
[null,null,null,null,null,null,null,null,null,null,null,null,null,48,"Seedpod",48,"Days","Load up this generator and start again",48,"hours of fucking yourself with a dildo",null,null,null,null,null,48,"Fill a bathtub with ice water and ice. Remain as long as possible in the water (clothed or not)."]
[null,null,null,null,null,null,null,null,null,null,null,null,null,49,"HolyTrainer",49,"Months","Be released",49,"unpleasent/painful/humiliating things of Master's choice",null,null,null,null,null,49,"Get stinging nettle and rub it on your balls, arse and nipples."]
[null,null,null,null,null,null,null,null,null,null,null,null,null,50,"Seedpod",50,"Weeks","Load up this generator and start again",50,"Punishment fucks, days drounded in bondage, work on your holes and CP of Masters choice",null,null,null,null,null,50,"Prepare 15 ice cubes, insert three and wait for the ice cubes to melt, then insert 3 more etc"]
[null,null,null,null,null,null,null,null,null,null,null,null,null,null,null,null,null,null,null,null,null,null,null,null,null,51,"Put some toothpaste on a finger or two and insert in you arse. Don't wash it for 10 minutes."]
[null,null,null,null,null,null,null,null,null,null,null,null,null,null,null,null,null,null,null,null,null,null,null,null,null,52,"Squeeze a whole tube toothpaste in your arse"]
[null,null,null,null,null,null,null,null,null,null,null,null,null,null,null,null,null,null,null,null,null,null,null,null,null,53,"Tie string around your balls and tie the other end around your big toe keep your knee at an angle when you do it. Keep it in place for 24 hours"]
[null,null,null,null,null,null,null,null,null,null,null,null,null,null,null,null,null,null,null,null,null,null,null,null,null,54,"Attach clothes pins or nipple clips to his nipples, balls, cock or wherever. Make a zipper and pull it off"]
[null,null,null,null,null,null,null,null,null,null,null,null,null,null,null,null,null,null,null,null,null,null,null,null,null,55,"Drip candle wax on him."]
[null,null,null,null,null,null,null,null,null,null,null,null,null,null,null,null,null,null,null,null,null,null,null,null,null,56,"Get rid of one of your limits"]
[null,null,null,null,null,null,null,null,null,null,null,null,null,null,null,null,null,null,null,null,null,null,null,null,null,57,"Have him lick You clean after you pee"]
[null,null,null,null,null,null,null,null,null,null,null,null,null,null,null,null,null,null,null,null,null,null,null,null,null,58,"Let your slave wear a diaper and let him take a laxative & water pill"]
[null,null,null,null,null,null,null,null,null,null,null,null,null,null,null,null,null,null,null,null,null,null,null,null,null,59,"Make him polish your shoes with his tongue"]
[null,null,null,null,null,null,null,null,null,null,null,null,null,null,null,null,null,null,null,null,null,null,null,null,null,60,"Mental punishment: Don't let him/her do something he/she likes. Like watching tv or playing games. Don't let him/her do this for 3 weeks"]
[null,null,null,null,null,null,null,null,null,null,null,null,null,null,null,null,null,null,null,null,null,null,null,null,null,61,"Tie him in an uncomfortable position."]
[null,null,null,null,null,null,null,null,null,null,null,null,null,null,null,null,null,null,null,null,null,null,null,null,null,62,"Tie his ankles together and attach his balls to them"]
[null,null,null,null,null,null,null,null,null,null,null,null,null,null,null,null,null,null,null,null,null,null,null,null,null,63,"Place an advert on Squirt offering his services for anyone who wants to (safely!) fuck him. Try to keep him as busy as possible for 24 hours."]
[null,null,null,null,null,null,null,null,null,null,null,null,null,null,null,null,null,null,null,null,null,null,null,null,null,64,"Have your slave \"wet\" himself. "]
[null,null,null,null,null,null,null,null,null,null,null,null,null,null,null,null,null,null,null,null,null,null,null,null,null,65,"Make your slave go a day with no food. "]
[null,null,null,null,null,null,null,null,null,null,null,null,null,null,null,null,null,null,null,null,null,null,null,null,null,66,"Ginger is a root used in cooking. When your slave shaves the skin off a small piece and inserts it into his anus it will be torture. A strong burning sensation will result. Ginger power does the same though to a much lesser degree. Be creative with this root"]
[null,null,null,null,null,null,null,null,null,null,null,null,null,null,null,null,null,null,null,null,null,null,null,null,null,67,"Soap can be quite painful. Have your slave cut a half inch sliver of soap off a bar. Then have him insert the sliver into his male member. Make him keep it there for a few minutes. Urination will now be very painful. "]
[null,null,null,null,null,null,null,null,null,null,null,null,null,null,null,null,null,null,null,null,null,null,null,null,null,68,"Make your slave wear a set of clothes he dislike. "]
[null,null,null,null,null,null,null,null,null,null,null,null,null,null,null,null,null,null,null,null,null,null,null,null,null,69,"Make your slave pour a bodily liquid over his head in the shower. "]
[null,null,null,null,null,null,null,null,null,null,null,null,null,null,null,null,null,null,null,null,null,null,null,null,null,70,"Don't use the toilet for 24 hours, you cant hold it, go outside or go in your pants"]
[null,null,null,null,null,null,null,null,null,null,null,null,null,null,null,null,null,null,null,null,null,null,null,null,null,71,"Sleep in a cupboard once a week until told otherwise"]
[null,null,null,null,null,null,null,null,null,null,null,null,null,null,null,null,null,null,null,null,null,null,null,null,null,72,"Your slave must wear the flies on his jeans down for 24 hours"]
[null,null,null,null,null,null,null,null,null,null,null,null,null,null,null,null,null,null,null,null,null,null,null,null,null,73,"Your slave should spend 24 hours listening to a hypnosys file of your from warpmymind.com on repeat"]
[null,null,null,null,null,null,null,null,null,null,null,null,null,null,null,null,null,null,null,null,null,null,null,null,null,74,"He must sleep in a garage"]
[null,null,null,null,null,null,null,null,null,null,null,null,null,null,null,null,null,null,null,null,null,null,null,null,null,75,"Give him a specific unpleasent chore. Make him do it more than once"]
[null,null,null,null,null,null,null,null,null,null,null,null,null,null,null,null,null,null,null,null,null,null,null,null,null,76,"Give him lines"]
[null,null,null,null,null,null,null,null,null,null,null,null,null,null,null,null,null,null,null,null,null,null,null,null,null,77,"tape his arse, cock and balls up so its as if he is wearing underwear."]
[null,null,null,null,null,null,null,null,null,null,null,null,null,null,null,null,null,null,null,null,null,null,null,null,null,78,"tie him up so that his arse is in the air, leave him like that and use the hole as you (or your friends) want."]
[null,null,null,null,null,null,null,null,null,null,null,null,null,null,null,null,null,null,null,null,null,null,null,null,null,79,"attach a bell to his collar"]
[null,null,null,null,null,null,null,null,null,null,null,null,null,null,null,null,null,null,null,null,null,null,null,null,null,80,"Attach a bell to his chastity device"]
[null,null,null,null,null,null,null,null,null,null,null,null,null,null,null,null,null,null,null,null,null,null,null,null,null,81,"attach a bell to him only when he is fucked at first. Then once he associates that sound with being fucked make him wear it all the time."]
[null,null,null,null,null,null,null,null,null,null,null,null,null,null,null,null,null,null,null,null,null,null,null,null,null,82,"Ground him for a number of days/weeks"]
[null,null,null,null,null,null,null,null,null,null,null,null,null,null,null,null,null,null,null,null,null,null,null,null,null,83,"Get him a tattoo of your choice"]
[null,null,null,null,null,null,null,null,null,null,null,null,null,null,null,null,null,null,null,null,null,null,null,null,null,84,"Get him tattooed above his chastity device"]
[null,null,null,null,null,null,null,null,null,null,null,null,null,null,null,null,null,null,null,null,null,null,null,null,null,85,"Get his cock/balls pierced, make him wear the chastity device to the piercer, have him explain why it is locked on and unlock him while he is there."]
[null,null,null,null,null,null,null,null,null,null,null,null,null,null,null,null,null,null,null,null,null,null,null,null,null,86,"Get his cock/balls pierced, make him wear the chastity device to the piercer, have him explain why it is locked on and unlock him while he is there."]
[null,null,null,null,null,null,null,null,null,null,null,null,null,null,null,null,null,null,null,null,null,null,null,null,null,87,"Get his nipples pierced, tell the piercer that it would be his cock getting pierced, but it is locked away for bad behaviour"]
[null,null,null,null,null,null,null,null,null,null,null,null,null,null,null,null,null,null,null,null,null,null,null,null,null,88,"Make him wear a nappy and don't allow him to fasten his fly for 24 hours"]
[null,null,null,null,null,null,null,null,null,null,null,null,null,null,null,null,null,null,null,null,null,null,null,null,null,89,"Make him wear a nappy for the weekend. He can only change it if he gets someone to do it for him"]
[null,null,null,null,null,null,null,null,null,null,null,null,null,null,null,null,null,null,null,null,null,null,null,null,null,90,"Make him drink 2 litres of water,padlock his jeans closed and send him out for a few hours"]
[null,null,null,null,null,null,null,null,null,null,null,null,null,null,null,null,null,null,null,null,null,null,null,null,null,91,"Peg on his tonge for an hour"]
[null,null,null,null,null,null,null,null,null,null,null,null,null,null,null,null,null,null,null,null,null,null,null,null,null,92,"On his last day of chastity, make him go out looking for sex (male/female, you choose). He has to get to get to the point where he will have to explain his chastity device before offering to do whatever the other person wants as compensation. If he doesn't complete the task he stays locked up until he does"]
[null,null,null,null,null,null,null,null,null,null,null,null,null,null,null,null,null,null,null,null,null,null,null,null,null,93,"Make him piss on his food before he eats it"]
[null,null,null,null,null,null,null,null,null,null,null,null,null,null,null,null,null,null,null,null,null,null,null,null,null,94,"Make him post an ad online saying that he will do anything for £1 as long as it is safe and legal, make him do the first 5 responses he gets."]
[null,null,null,null,null,null,null,null,null,null,null,null,null,null,null,null,null,null,null,null,null,null,null,null,null,95,"Make him wear double nappys. The bottom one should have a slits cut in it so that the liquid can flow to the top nappy. At 6 AM he has to drink 2 litres of water. Everytime he pisses he must drink another 2 glasses of water. Make him go about his normal day. The nappy remains in place for 24 hours."]
[null,null,null,null,null,null,null,null,null,null,null,null,null,null,null,null,null,null,null,null,null,null,null,null,null,96,"Before bed each night when his cock is locked he must lick your arse until you tell him to stop. Don't worry if you aren't in the mood he can lick the rim of the toilet instead."]
[null,null,null,null,null,null,null,null,null,null,null,null,null,null,null,null,null,null,null,null,null,null,null,null,null,97,"If available rub stinging nettles on his balls then whip him with them. If not available choose another punishment."]
[null,null,null,null,null,null,null,null,null,null,null,null,null,null,null,null,null,null,null,null,null,null,null,null,null,98,"Make a dildo out of ice, suck it for a minute to get rid of any sharp bits then fuck yourself with it until it melts. If your owner says to, use the machine"]
[null,null,null,null,null,null,null,null,null,null,null,null,null,null,null,null,null,null,null,null,null,null,null,null,null,99,"Complete all of the dice games"]
[null,null,null,null,null,null,null,null,null,null,null,null,null,null,null,null,null,null,null,null,null,null,null,null,null,100,"Generate 3 more punishments and complete them all."]

{"sheet":"Dice Games","index":2,"n_rows":153,"n_cols":2,"rows_kept":153,"cut":false,"hidden":true,"merged":[]}
[]
[null,"Dice Games"]
[]
[null,"Flick Dice Game"]
[null,"After a number has been rolled once use the bolded number the second time. The game ends after every number has been rolled twice."]
[]
[null,"1 - put small item in anus (pen cap, pen, eraser) 1"]
[null,"2 - place two clothespins on penis, or on nipples. 3"]
[null,"3 - remove all clothing except undergarments. 4"]
[null,"4 - flick testicles with finger X times. (roll dice for X) 2, 5"]
[null,"5 - skip to bold numbers"]
[null,"6 - skip to bold numbers"]
[null,"1 - flick testicles with finger X times. (roll dice for X)"]
[null,"2 - attach 2 clothespins to testicles or nipple"]
[null,"3 - flick testicles with finger X times. (roll dice for X)"]
[null,"4 - attach 4 clothespins to testicles or nipple & 1 to cock head"]
[null,"5 - flick testicles with finger X times. (roll  2 dice for X)"]
[null,"6 - attach X clothespins to testicles or nipple & 1 to cock head (roll 2 dice for x)5, 8"]
[null,"Slivers Of Pain"]
[null,"After a number has been rolled once use the bolded number the second time. The game ends after every number has been rolled twice. This game uses the soap sliver punishment. More info about this on the punishment page."]
[]
[null,"1 - drink one cup of water  5"]
[null,"2 - one sliver of soap (if one is already in there, add second)"]
[null,"3 - drink one cup of water 3"]
[null,"4 - one sliver of soap (if one is already in there, add second) 4"]
[null,"5 - drink one cup of water 2"]
[null,"6 - one sliver of soap (if one is already in there, add second) 1"]
[null,"1 - drink quarter cup of water"]
[null,"2 - put 1 eraser or small abject in anus"]
[null,"3 - attach 1 clothespin to testicles or nipple"]
[null,"4 - flick testicles with finger X times. (roll dice for X)"]
[null,"5 - drink quarter cup of water"]
[null,"6 - flick testicles with finger X times. (roll dice for X) 6 (10)"]
[]
[null,"this one can be very painful because if it goes on for a long time and you have 5 slivers of soap in your penis and you piss right there, its gonna hurt."]
[null,"Cold Dice Game"]
[null,"After a number has been rolled once use the bolded number the second time. The game ends after 3 turns."]
[]
[null,"1 - Put 3 cubes of ice down pants. Wait X minutes before resuming game. (Roll for X)"]
[null,"2 - Put small ice cube in anus. Wait X minutes before resuming game. (Roll for X)"]
[null,"3 - Insert cube in anus. Remove, clean with hands and put in mouth for 20 seconds."]
[null,"4 - Rub 1 cube all over your body, eat after the rub."]
[null,"5 - Clean genitals with one cube for 30 seconds. Then eat."]
[null,"6 - Roll again!"]
[null,"Clothing Dice Game"]
[null,"After a number has been rolled once use the bolded number the second time. The game ends if game says so."]
[]
[null,"1 - remove shirt"]
[null,"2 - remove pants"]
[null,"3 - remove undergarments"]
[null,"4 - put back on item of choice"]
[null,"5 - remove socks & shoes"]
[null,"6 - roll again (game ends the third time 6 is rolled)"]
[null,"This one may get embarasing. If they roll a 3, then they need to take off all there clothes and then put everything on except undergarments."]
[null,"Ultimate Dice Dare Game"]
[null,"Roll 1: What to Wear"]
[null,"1. What your wearing now."]
[null,"2. Nothing/Nude"]
[null,"3. Guys: Boxers only. Gals: Panties only, no bras"]
[null,"4. Nothing on bottom, anything you choose on top"]
[null,"5. Anything you choose on bottom, nothing on top."]
[null,"6. Nothing/Nude"]
[]
[null,"Roll 2: Where?"]
[null,"1. In your bedroom."]
[null,"2. In bathroom"]
[null,"3. In Garage"]
[null,"4. In Kitchen"]
[null,"5. In Woods"]
[null,"6. In back yard"]
[]
[null,"Roll 3: How many objectives must you complete?"]
[null,"1. 2 Objectives"]
[null,"2. 3 Objectives"]
[null,"3. 4 Objectives"]
[null,"4. 5 Objectives"]
[null,"5. 6 Objectives"]
[null,"6. 7 Objectives"]
[]
[null,"Roll 4: Roll 2 dice (number of times you got above) to receive objectives."]
[null,"2. Pee into a bowl and give yourself an enema with your own urine."]
[null,"3. Roll one dice. Stick that number of ice cubes into your ass"]
[null,"4.Fill a bowl with cold water and lots of ice cubes. Stick your boobs or dick into the bowl for 3 minutes."]
[null,"5. Moon the next person you see."]
[null,"6. Lay naked in your yard (or other place) for 10 minutes"]
[null,"7. Stick the largest thing that will fit in your ass up there and let it sit there for 8 minutes."]
[null,"8. Spank yourself with a spoon HARD 30 times"]
[null,"9. Color your boobs or dick with a Sharpie"]
[null,"10. Walk to get your mail naked, but \"accidentally\" drop it and make dramatic bends while picking it up."]
[null,"11. Take a picture in whatever your wearing (or not wearing) and post it on the thread (if possible)"]
[null,"12. Masturbate and cum on a window people could see you from. Then use your boobs or dick to wipe it up."]
[]
[null,"Roll 5: Pick Punishment (If you did 4 or less objectives)"]
[null,"1. Pee outside"]
[null,"2. Shit outside"]
[null,"3. Spank yourself 50 times HARD"]
[null,"4. Get someone to spank you nude 20 times"]
[null,"5. Snap a rubber band on your penis or vagina 10 times. ( It hurts)"]
[null,"6. Your lucky, you escaped punishment."]
[]
[null,"Roll 6: How Many times must you do this?"]
[null,"1. Twice today"]
[null,"2. Twice this week"]
[null,"3. Everyday this week"]
[null,"4. 6 times this month"]
[null,"5. 8 times this month"]
[null,"6. Your choice of 3 or 4"]
[null,"Pain And Bravery Dice Game"]
[null,"Roll 1: What to wear?"]
[]
[null,"1. Nude/Nothing"]
[null,"2. Boxers/Panties (Girls no bra)"]
[null,"3. Nude/Nothing"]
[null,"4. Top Only, no bottoms"]
[null,"5. Nude/Nothing"]
[null,"6. Shoes and socks & nappy"]
[]
[null,"Roll 2: Where to do it?"]
[null,"1. Garage"]
[null,"2. Kitchen"]
[null,"3. Back Yard"]
[null,"4. Garage"]
[null,"5. In Woods"]
[null,"6. Your choice of any above"]
[]
[null,"Roll 3: How many objectives do I have to do?"]
[null,"1. 2 Objectives"]
[null,"2. 3 Objectives"]
[null,"3. 6 Objectives"]
[null,"4. 4 Objectives"]
[null,"5. 7 Objectives"]
[null,"6. 5 Objectives"]
[]
[null,"Roll 4: Roll (how ever many times you got above) to receive objectives. Use two dice."]
[null,"2. Take toothpaste and squeeze a good amount into your ass. Wait for 8 minutes and then put an icecube into your ass to cool things down."]
[null,"3. Take 4 Clamps. One on each nipple, and one on each of your balls (if guy) or two on your clit (If gal)"]
[null,"4. Drink 4 glasses of water and when you have to urinate, pee into a cup. Then use the pee for an enema."]
[null,"5. Find a candle and light it. Let the wax drip onto your dick or vagina. Then put clamps on the skin where the wax is and masturbate until you reach edge. Then rip the clamps off and cum."]
[null,"6. Any objective 2-5"]
[null,"7. Find a worm and put it in your ass."]
[null,"8. Put some toothpaste in your ass. Then put a pen in your ass and attempt to write \"I'll be a good boy/girl\" 5 times on the paper. To add spice put a clamp on the front end."]
[null,"9. Stand in front of a window naked (regardless of clothing above) and masturbate for 30 minutes, regardless of who walks by or what happens."]
[null,"10. Spank yourself with a hairbrush 50 times. HARD"]
[null,"11. Get a bowl of water with lots of ice. Stick your dick or boobs into it for 3 minutes."]
[null,"12. Put 6 icecubes into your ass at once. Wait 25 minutes and then go to the bathroom, and when you leave, squeeze your dick or boobs in the door 3 times on the way out."]
[]
[null,"Roll 5: How many times must I do this?"]
[null,"1. Twice today"]
[null,"2. Twice this week"]
[null,"3. Everyday this week."]
[null,"4. 8 times in two weeks."]
[null,"5. Everday for two weeks."]
[null,"6. 16 times in three weeks."]

{"sheet":"BDSM list","index":3,"n_rows":222,"n_cols":6,"rows_kept":222,"cut":false,"hidden":true,"merged":[[1,1,2,5],[3,1,6,5]]}
[]
[null,"BDSM list"]
[]
[null,"Fill in this document:\nExperience with yes or no and tolerate with 0 - 5\n0 = don't do this ever - 1 = don't want to do this - 2 = don't like to do this\n3 = want to do this - 4 = Like to do this - 5 = Loves me on"]
[]
[]
[]
[]
[null,"nr.","Your appearance","Exp\ny / n","Tolerate\n 0-5","Comments"]
[null,1,"Leather clothing"]
[null,2,"Leather clothing in public"]
[null,3,"Rubber clothing"]
[null,4,"Rubber clothing in public"]
[null,5,"Forced clothing by Dom"]
[null,6,"See through clothing"]
[null,7,"See through clothing in public"]
[null,8,"See through clothing without underwear"]
[null,9,"Wearing high heals"]
[null,10,"Chastity belt"]
[null,11,"Chastity belt in public"]
[null,12,"Collar"]
[null,13,"Collar in public"]
[null,14,"Cuffs"]
[null,15,"Cuffs in public"]
[null,16,"Clutty clothes"]
[null,17,"Clutty clothes in public"]
[null,18,"Nudity"]
[null,19,"Nudity in public"]
[null,20,"Uniforms like police, firemen or army"]
[null,21,"Uniforms like nurse or waitress"]
[null,22,"Forced nudity"]
[null,23,"Forced nudity in public"]
[null,24,"Striptease"]
[null,25,"Piercing"]
[null,26,"Tatoos"]
[null,27,"Shaving body hair"]
[null,28,"Shaving pubic hair"]
[null,29,"Shaving hair on head"]
[null,"nr.","Limitations","Exp\ny / n","Tolerate\n 0-5","Comments"]
[null,30,"Breast tie"]
[null,31,"Stern breast tie"]
[null,32,"Stern breast tie with nipple clamps"]
[null,33,"Metal cuffs"]
[null,34,"Chains"]
[null,35,"Leather collars"]
[null,36,"Light bondage"]
[null,37,"Heavy bondage"]
[null,38,"Heavy bondage with torture"]
[null,39,"Suspention"]
[null,40,"Leather cuffs"]
[null,41,"Bondage for more then an hour"]
[null,42,"Bondage on a public place"]
[null,43,"Finger tie"]
[null,44,"Big toes together"]
[null,45,"Tie off clitoris"]
[null,46,"Mouth gag"]
[null,47,"Rubber ball gag"]
[null,48,"Taping mouth with tape"]
[null,49,"Foil wrap"]
[null,50,"Clamps on the breast"]
[null,51,"Clamps on the penis / balls / vagina"]
[null,52,"Clamps on the face"]
[null,53,"Clamps on the body"]
[null,54,"Clamps connected to eachother with tie"]
[null,55,"Leggs spread during standup position"]
[null,56,"Leggs spread during lying position"]
[null,57,"Walking limitations"]
[null,58,"Locked up in cage"]
[null,59,"Locked up in dark cage"]
[null,60,"Locked up in very small cage"]
[null,61,"Locked up for more then an hour"]
[null,62,"cover eyes, ears, nose"]
[null,"nr.","Punishment","Exp\ny / n","Tolerate\n 0-5","Comments"]
[null,63,"Biting"]
[null,64,"Tickling"]
[null,65,"have a tongue on your body"]
[null,66,"Spanking"]
[null,67,"Wheel of pain"]
[null,68,"Pulling your hair"]
[null,69,"Ice cubes on your body"]
[null,70,"Have nails on your body"]
[null,71,"Spanking as punishment"]
[null,72,"Soft punch in the face"]
[null,73,"Hard punch in the face"]
[null,74,"Soft pain"]
[null,75,"Hard pain"]
[null,76,"Torture by removing hair"]
[null,77,"Soft torture by whip"]
[null,78,"Hard torture by whip"]
[null,79,"Punch on the genitals"]
[null,80,"Strech vagina"]
[null,81,"Strech anus"]
[null,82,"Candle wax on the body"]
[null,83,"Candle wax on the genitals"]
[null,84,"nipple clamps"]
[null,85,"Nipple torture, pinch, nails, …"]
[null,86,"Clamps to genitals"]
[null,87,"Clamps on breasts"]
[null,88,"Clamps on tongue"]
[null,89,"Clamps on lipps"]
[null,90,"Electro treatment genitals"]
[null,91,"Electro treatment breasts & nipples"]
[null,92,"Electro treatment anal"]
[null,93,"Electro with the fly catcher"]
[null,94,"Wearing a butt plug during the day"]
[null,95,"Cold shower"]
[null,"nr.","Humilation","Exp\ny / n","Tolerate\n 0-5","Comments"]
[null,96,"Stand in the corner like a child"]
[null,97,"Follow commands"]
[null,98,"Verbal humilation"]
[null,99,"Kneel during commands"]
[null,100,"Kneel when your Dom enters"]
[null,101,"Lick when you like the command"]
[null,102,"Punishment when misbehave"]
[null,103,"Humilation"]
[null,104,"Humilation in public"]
[null,105,"Spit in the face"]
[null,106,"Spit in open mouth"]
[null,107,"Spit on genitals"]
[null,108,"Penis worship"]
[null,109,"Vagina worship"]
[null,110,"Forced smoking"]
[null,111,"Feet worship"]
[null,112,"Choosing clothes by Dom"]
[null,113,"Choosing food by Dom"]
[null,114,"Serve as waitress"]
[null,115,"Serve naked"]
[null,116,"Serve as couch"]
[null,117,"Serve as resting place feet"]
[null,118,"Stay at the feet of your Dom"]
[null,119,"Sleeping at the feet of your Dom"]
[null,120,"Sleeping on the ground"]
[null,121,"Householding"]
[null,122,"Householding in uniform"]
[null,123,"Householding naked"]
[null,124,"Limitations in speech"]
[null,125,"No sex command"]
[null,126,"No sex for longer time command"]
[null,127,"No sex unless on command"]
[null,128,"Drinking alcohol"]
[null,129,"Eye contact with Dom"]
[null,130,"Bathroom limitation"]
[null,131,"After getting horny, don't cum"]
[null,132,"Model for erotic pictures"]
[null,133,"Model for obscene pictures"]
[null,134,"Watch a porn movie"]
[null,135,"Make a porn movie yourself"]
[null,136,"Do you like to watch?"]
[null,137,"Do you like being watch?"]
[null,138,"Playing outdoor, woods, strange places"]
[null,"nr.","Sexuality","Exp\ny / n","Tolerate\n 0-5","Comments"]
[null,139,"Masturbating"]
[null,140,"Masturbating by others"]
[null,141,"Anal sex"]
[null,142,"Suck cock"]
[null,143,"Eat pussy"]
[null,144,"Suck strapon"]
[null,145,"Vibrator under clothes"]
[null,146,"Butt plug under clothes"]
[null,147,"Fistfuck vagina"]
[null,148,"Fistfuck anal"]
[null,149,"Multiple penetration"]
[null,150,"Forced gay behaviour"]
[null,151,"Forced streight behaviour"]
[null,152,"Sperm shower in face"]
[null,153,"Sperm shower on body"]
[null,154,"Sperm catch with mouth"]
[null,155,"Swallow sperm"]
[null,156,"Sexual abused"]
[null,157,"Sexual abused by others"]
[null,158,"Outdoor on a save place"]
[null,159,"Outdoor with possible caught"]
[null,160,"Have sex with man and woman"]
[null,"nr.","Roleplay","Exp\ny / n","Tolerate\n 0-5","Comments"]
[null,161,"Roleplay general?"]
[null,162,"Serve as waitress"]
[null,163,"Serve as maid"]
[null,164,"Age play"]
[null,165,"Pony play"]
[null,166,"Puppy play"]
[null,167,"Slave play"]
[null,168,"Left tied on a tree"]
[null,169,"Being raped"]
[null,170,"Being caught and locked up"]
[null,171,"Nursing"]
[null,172,"Sex in a public place"]
[null,"nr.","Breathing","Exp\ny / n","Tolerate\n 0-5","Comments"]
[null,172,"Breath restriction"]
[null,173,"Breath restriction by hand on mouth"]
[null,174,"Breath restriction under water"]
[null,175,"Breath restriction gas mask"]
[null,176,"Breath restriction hands on troath"]
[null,"nr.","P&P","Exp\ny / n","Tolerate\n 0-5","Comments"]
[null,177,"peeing while someone is watching"]
[null,178,"Pooping games"]
[null,179,"The use of a peebowl"]
[null,180,"Wearing diapers"]
[null,181,"Peeing while wearing diaper"]
[null,182,"Pooping while wearing diaper"]
[null,183,"Catheter"]
[null,184,"Forced peeing in bed"]
[null,185,"catch pee with mouth"]
[null,186,"swallow pee"]
[null,187,"Peeing over your body"]
[null,188,"Swap sperm from mouth to mouth"]
[null,"nr.","General","Exp\ny / n","Tolerate\n 0-5","Comments"]
[null,189,"Do want 24/7 sm game play?"]
[null,190,"Do you like to play the sub?"]
[null,191,"Do want sm to enter your daily life?"]
[null,192,"Changing clothes in public places?"]
[null,193,"Running naked illigally"]
[null,194,"Do you want to be blindfolded all the time?"]
[null,195,"May there be music?"]
[null,196,"Bi sexual feelings?"]
[null,197,"Try bi sexual contact?"]
[null,198,"Do you like humor during the play?"]
[null,199,"Do you like to talk about sm to others?"]
[null,200,"Do you see sm like something natural?"]
[null,"nr.","Going out","Exp\ny / n","Tolerate\n 0-5","Comments"]
[null,201,"Would you like to have meeting online?"]
[null,202,"Have webcam session online"]
[null,203,"Have an orgy?"]

{"sheet":"Dice Game","index":4,"n_rows":153,"n_cols":4,"rows_kept":153,"cut":false,"hidden":false,"merged":[]}
[]
["Dice Games"]
[]
["Flick Dice Game"]
["After a number has been rolled once use the bolded number the second time. The game ends after every number has been rolled twice.",null,"Dice Number","Score"]
[null,null,1,{"$f":"RANDBETWEEN(1,6)","v":2}]
["1 - put small item in anus (pen cap, pen, eraser) 1",null,2,{"$f":"RANDBETWEEN(1,6)","v":3}]
["2 - place two clothespins on penis, or on nipples. 3",null,"Total",{"$f":"SUM(D6:D7)","v":5}]
["3 - remove all clothing except undergarments. 4"]
["4 - flick testicles with finger X times. (roll dice for X) 2, 5"]
["5 - skip to bold numbers"]
["6 - skip to bold numbers"]
["1 - flick testicles with finger X times. (roll dice for X)"]
["2 - attach 2 clothespins to testicles or nipple"]
["3 - flick testicles with finger X times. (roll dice for X)"]
["4 - attach 4 clothespins to testicles or nipple & 1 to cock head"]
["5 - flick testicles with finger X times. (roll  2 dice for X)"]
["6 - attach X clothespins to testicles or nipple & 1 to cock head (roll 2 dice for x)5, 8"]
["Slivers Of Pain"]
["After a number has been rolled once use the bolded number the second time. The game ends after every number has been rolled twice. This game uses the soap sliver punishment. More info about this on the punishment page."]
[]
["1 - drink one cup of water  5"]
["2 - one sliver of soap (if one is already in there, add second)"]
["3 - drink one cup of water 3"]
["4 - one sliver of soap (if one is already in there, add second) 4"]
["5 - drink one cup of water 2"]
["6 - one sliver of soap (if one is already in there, add second) 1"]
["1 - drink quarter cup of water"]
["2 - put 1 eraser or small abject in anus"]
["3 - attach 1 clothespin to testicles or nipple"]
["4 - flick testicles with finger X times. (roll dice for X)"]
["5 - drink quarter cup of water"]
["6 - flick testicles with finger X times. (roll dice for X) 6 (10)"]
[]
["this one can be very painful because if it goes on for a long time and you have 5 slivers of soap in your penis and you piss right there, its gonna hurt."]
["Cold Dice Game"]
["After a number has been rolled once use the bolded number the second time. The game ends after 3 turns."]
[]
["1 - Put 3 cubes of ice down pants. Wait X minutes before resuming game. (Roll for X)"]
["2 - Put small ice cube in anus. Wait X minutes before resuming game. (Roll for X)"]
["3 - Insert cube in anus. Remove, clean with hands and put in mouth for 20 seconds."]
["4 - Rub 1 cube all over your body, eat after the rub."]
["5 - Clean genitals with one cube for 30 seconds. Then eat."]
["6 - Roll again!"]
["Clothing Dice Game"]
["After a number has been rolled once use the bolded number the second time. The game ends if game says so."]
[]
["1 - remove shirt"]
["2 - remove pants"]
["3 - remove undergarments"]
["4 - put back on item of choice"]
["5 - remove socks & shoes"]
["6 - roll again (game ends the third time 6 is rolled)"]
["This one may get embarasing. If they roll a 3, then they need to take off all there clothes and then put everything on except undergarments."]
["Ultimate Dice Dare Game"]
["Roll 1: What to Wear"]
["1. What your wearing now."]
["2. Nothing/Nude"]
["3. Guys: Boxers only. Gals: Panties only, no bras"]
["4. Nothing on bottom, anything you choose on top"]
["5. Anything you choose on bottom, nothing on top."]
["6. Nothing/Nude"]
[]
["Roll 2: Where?"]
["1. In your bedroom."]
["2. In bathroom"]
["3. In Garage"]
["4. In Kitchen"]
["5. In Woods"]
["6. In back yard"]
[]
["Roll 3: How many objectives must you complete?"]
["1. 2 Objectives"]
["2. 3 Objectives"]
["3. 4 Objectives"]
["4. 5 Objectives"]
["5. 6 Objectives"]
["6. 7 Objectives"]
[]
["Roll 4: Roll 2 dice (number of times you got above) to receive objectives."]
["2. Pee into a bowl and give yourself an enema with your own urine."]
["3. Roll one dice. Stick that number of ice cubes into your ass"]
["4.Fill a bowl with cold water and lots of ice cubes. Stick your boobs or dick into the bowl for 3 minutes."]
["5. Moon the next person you see."]
["6. Lay naked in your yard (or other place) for 10 minutes"]
["7. Stick the largest thing that will fit in your ass up there and let it sit there for 8 minutes."]
["8. Spank yourself with a spoon HARD 30 times"]
["9. Color your boobs or dick with a Sharpie"]
["10. Walk to get your mail naked, but \"accidentally\" drop it and make dramatic bends while picking it up."]
["11. Take a picture in whatever your wearing (or not wearing) and post it on the thread (if possible)"]
["12. Masturbate and cum on a window people could see you from. Then use your boobs or dick to wipe it up."]
[]
["Roll 5: Pick Punishment (If you did 4 or less objectives)"]
["1. Pee outside"]
["2. Shit outside"]
["3. Spank yourself 50 times HARD"]
["4. Get someone to spank you nude 20 times"]
["5. Snap a rubber band on your penis or vagina 10 times. ( It hurts)"]
["6. Your lucky, you escaped punishment."]
[]
["Roll 6: How Many times must you do this?"]
["1. Twice today"]
["2. Twice this week"]
["3. Everyday this week"]
["4. 6 times this month"]
["5. 8 times this month"]
["6. Your choice of 3 or 4"]
["Pain And Bravery Dice Game"]
["Roll 1: What to wear?"]
[]
["1. Nude/Nothing"]
["2. Boxers/Panties (Girls no bra)"]
["3. Nude/Nothing"]
["4. Top Only, no bottoms"]
["5. Nude/Nothing"]
["6. Shoes and socks & nappy"]
[]
["Roll 2: Where to do it?"]
["1. Garage"]
["2. Kitchen"]
["3. Back Yard"]
["4. Garage"]
["5. In Woods"]
["6. Your choice of any above"]
[]
["Roll 3: How many objectives do I have to do?"]
["1. 2 Objectives"]
["2. 3 Objectives"]
["3. 6 Objectives"]
["4. 4 Objectives"]
["5. 7 Objectives"]
["6. 5 Objectives"]
[]
["Roll 4: Roll (how ever many times you got above) to receive objectives. Use two dice."]
["2. Take toothpaste and squeeze a good amount into your ass. Wait for 8 minutes and then put an icecube into your ass to cool things down."]
["3. Take 4 Clamps. One on each nipple, and one on each of your balls (if guy) or two on your clit (If gal)"]
["4. Drink 4 glasses of water and when you have to urinate, pee into a cup. Then use the pee for an enema."]
["5. Find a candle and light it. Let the wax drip onto your dick or vagina. Then put clamps on the skin where the wax is and masturbate until you reach edge. Then rip the clamps off and cum."]
["6. Any objective 2-5"]
["7. Find a worm and put it in your ass."]
["8. Put some toothpaste in your ass. Then put a pen in your ass and attempt to write \"I'll be a good boy/girl\" 5 times on the paper. To add spice put a clamp on the front end."]
["9. Stand in front of a window naked (regardless of clothing above) and masturbate for 30 minutes, regardless of who walks by or what happens."]
["10. Spank yourself with a hairbrush 50 times. HARD"]
["11. Get a bowl of water with lots of ice. Stick your dick or boobs into it for 3 minutes."]
["12. Put 6 icecubes into your ass at once. Wait 25 minutes and then go to the bathroom, and when you leave, squeeze your dick or boobs in the door 3 times on the way out."]
[]
["Roll 5: How many times must I do this?"]
["1. Twice today"]
["2. Twice this week"]
["3. Everyday this week."]
["4. 8 times in two weeks."]
["5. Everday for two weeks."]
["6. 16 times in three weeks."]